{"text_format":"1","workbook":"xlsx","n_sheets":10,"sheets":["Overview","Action  Plan","1. Costs linked to activities","2. Communication Costs","3. Travel & Subsistence costs","4. Personnel  costs","5. Indirect Costs","Co-financing  Income","Breakdown & Project Funding","Data sources"],"not_rendered":{"charts":0,"images":2,"macros":1,"external_links":0,"defined_names":87,"comments":0,"pivot_tables":0},"unopened":[],"bounds":{"document_bytes":16777216,"sheet_cells":100000,"rows_first":2000,"rows_last":500,"rows_between":2000,"halvings":0,"cell_chars":16384,"cell_head_chars":4096},"cells_cut":0,"cells_raw":0,"read":"whole","date_system":"1900"}

{"sheet":"Overview","index":0,"n_rows":86,"n_cols":14,"rows_kept":86,"cut":false,"hidden":false,"merged":[[17,5,17,9],[12,1,12,2],[15,1,15,9],[28,13,30,13],[25,1,25,3],[28,1,28,7],[18,1,18,3],[19,1,19,3],[24,1,24,3],[20,1,20,3],[21,1,21,3],[20,5,20,8],[21,5,21,8],[23,5,23,8],[22,1,22,3],[22,5,22,8],[26,1,26,3],[24,5,24,8],[23,11,24,11],[25,5,25,8],[26,7,26,8],[6,1,6,9],[7,1,7,9],[8,1,8,9],[10,1,10,2],[11,1,11,2],[10,4,10,9],[11,6,11,9],[23,1,23,2],[12,4,12,9],[13,1,13,2],[13,3,13,9],[19,7,19,8],[18,5,18,8],[17,1,17,4]]}
[]
[]
[]
[]
[null,null,null,"CREATIVE EUROPE - CULTURE"]
[]
[null,"Before completing this table please read carefully the Guidelines and Guide for applicants available here: \nhttps://eacea.ec.europa.eu/creative-europe/funding/support-european-cooperation-projects-2019_en "]
[null,"CALL FOR PROPOSALS – EACEA 34/2018 - 'Support for European Cooperation Projects 2019'"]
[]
[]
[null,"Action",null,null,{"$f":"IF(D11=\"\",\"Please select an action type\",\"\")","v":"Please select an action type"}]
[null,"Duration / Eligibility period",null,null,"to",null,{"$f":"IF(OR(D12=\"\",F12=\"\"),\"Please insert the eligibility period of the project (dd/mm/yyyy)\",\"\")","v":"Please insert the eligibility period of the project (dd/mm/yyyy)"}]
[null,"Project Acronym",null,null,{"$f":"IF(D13=\"\",\"Please fill in Project Acronym\",\"\")","v":"Please fill in Project Acronym"}]
[null,"Project Title"]
[]
[null,"GENERAL OVERVIEW OF THE BUDGET (in EUR)"]
[]
[null,"EXPENDITURE PART",null,null,null,"INCOME PART"]
[null,"1. Costs directly linked to the implementation of project activities",null,null,{"$f":"SUM(E32:E86)","v":0},"1. Distribution of the EU grant requested between partners",null,null,null,{"$f":"SUMIF('Co-financing  Income'!$E:$E,'Data sources'!$L4,'Co-financing  Income'!$I:$I)","v":0}]
[null,"2. Communication, promotion and dissemination costs and costs of exploitation of results",null,null,{"$f":"SUM(F32:F86)","v":0},null,null,"% of the co-financing for the EU grant",null,{"$f":"IF(E25=0,0,ROUND(L29/J29,2))","v":0},null,{"$f":"IF(AND(D11='Data sources'!L29,ROUND(Overview!J20,2)>60%),\"% requested too high\",IF(AND(Overview!D11='Data sources'!L30,ROUND(Overview!J20,2)>50%),\"% requested too high\",\"\"))","v":""}]
[null,"3. Travel & subsistence costs",null,null,{"$f":"SUM(G32:G86)","v":0},"2. Income generated by the project",null,null,null,{"$f":"SUMIF('Co-financing  Income'!$E:$E,'Data sources'!$L5,'Co-financing  Income'!$I:$I)","v":0}]
[null,"4. Personnel costs",null,null,{"$f":"SUM(H32:H86)","v":0},"3. Self-financing in own and raised funds",null,null,null,{"$f":"SUMIF('Co-financing  Income'!$E:$E,'Data sources'!$L6,'Co-financing  Income'!$I:$I)","v":0}]
[null,"TOTAL DIRECT COSTS",null,null,{"$f":"SUM(E19:E22)","v":0},"4.1. Contributions from private sources",null,null,null,{"$f":"SUMIF('Co-financing  Income'!$E:$E,'Data sources'!$L7,'Co-financing  Income'!$I:$I)","v":0}]
[null,"5. Indirect costs",null,{"$f":"IF(E23=0,0,E24/E23)","v":0},{"$f":"IF(SUM(I32:I86)>E23*7%,E23*7%,SUM(I32:I86))","v":0},"4.2. Contributions from public sources",null,null,null,{"$f":"SUMIF('Co-financing  Income'!$E:$E,'Data sources'!$L8,'Co-financing  Income'!$I:$I)","v":0},null,{"$f":"IF((ROUND(E25,2)=ROUND(J25,2)),\"\",\"UNBALANCED BUDGET\")","v":""}]
[null,"TOTAL ESTIMATED BUDGET",null,null,{"$f":"+E23+E24","v":0},"TOTAL ESTIMATED REVENUE",null,null,null,{"$f":"J19+SUM(J21:J24)","v":0}]
[null,"On which the total costs incurred in or in relation to a third country are estimated to an amount of",null,null,0,{"$f":"IF(D11=\"\",\"\",IF(D11='Data sources'!L29,'Data sources'!L27,'Data sources'!L28))","v":""}]
[null,"Max. 30% of the total costs can be allocated to costs incurred in or in relation to a third country = ",null,null,{"$f":"E25*0.3","v":0},null,null,"Max. amount of the EU grant for the project:",null,{"$f":"IF(D11=\"Category 1 - Smaller scale\",E25*0.6,IF(D11=\"Category 2 - Larger scale\",E25*0.5,0))","v":0}]
[]
[null,"DISTRIBUTION OF THE BUDGET AND EU GRANT REQUESTED BY PARTNERS (in EUR)",null,null,null,null,null,null,"Total ",{"$f":"SUM(J32:J86)","v":0},null,{"$f":"SUM(L32:L86)","v":0},null,"Check\nData\nEncoding"]
[]
[null,"Partner \nN°","Name of Partner","Country","1. Costs linked to activities","2. Communication \nCosts","3. Travel & Subsistence\nCosts","4. Personnel \nCosts","5. Indirect costs","Total \nCosts (in EUR)",null,"Total \nEU grant (in EUR)"]
[null,"P1",null,null,{"$f":"SUMIF('1. Costs linked to activities'!E:E,B32,'1. Costs linked to activities'!J:J)","v":0},{"$f":"SUMIF('2. Communication Costs'!E:E,B32,'2. Communication Costs'!J:J)","v":0},{"$f":"SUMIF('3. Travel & Subsistence costs'!F:F,C32,'3. Travel & Subsistence costs'!M:M)+SUMIF('3. Travel & Subsistence costs'!F:F,C32,'3. Travel & Subsistence costs'!Q:Q)","v":0},{"$f":"SUMIF('4. Personnel  costs'!E:E,B32,'4. Personnel  costs'!W:W)","v":0},{"$f":"SUMIF('5. Indirect Costs'!B:B,B32,'5. Indirect Costs'!G:G)","v":0},{"$f":"SUM(E32:I32)","v":0},null,{"$f":"SUMIFS('Co-financing  Income'!I:I,'Co-financing  Income'!B:B,Overview!B32,'Co-financing  Income'!E:E,'Data sources'!$L$4)","v":0},null,{"$f":"IF(OR(COUNTIF('Data sources'!$I$11:$I$193,Overview!D32)=0,Overview!C32=\"\"),\"Error\",\"\")","v":"Error"}]
[null,"P2",null,null,{"$f":"SUMIF('1. Costs linked to activities'!E:E,B33,'1. Costs linked to activities'!J:J)","v":0},{"$f":"SUMIF('2. Communication Costs'!E:E,B33,'2. Communication Costs'!J:J)","v":0},{"$f":"SUMIF('3. Travel & Subsistence costs'!F:F,C33,'3. Travel & Subsistence costs'!M:M)+SUMIF('3. Travel & Subsistence costs'!F:F,C33,'3. Travel & Subsistence costs'!Q:Q)","v":0},{"$f":"SUMIF('4. Personnel  costs'!E:E,B33,'4. Personnel  costs'!W:W)","v":0},{"$f":"SUMIF('5. Indirect Costs'!B:B,B33,'5. Indirect Costs'!G:G)","v":0},{"$f":"SUM(E33:I33)","v":0},null,{"$f":"SUMIFS('Co-financing  Income'!I:I,'Co-financing  Income'!B:B,Overview!B33,'Co-financing  Income'!E:E,'Data sources'!$L$4)","v":0},null,{"$f":"IF(OR(COUNTIF('Data sources'!$I$11:$I$193,Overview!D33)=0,Overview!C33=\"\"),\"Error\",\"\")","v":"Error"}]
[null,"P3",null,null,{"$f":"SUMIF('1. Costs linked to activities'!E:E,B34,'1. Costs linked to activities'!J:J)","v":0},{"$f":"SUMIF('2. Communication Costs'!E:E,B34,'2. Communication Costs'!J:J)","v":0},{"$f":"SUMIF('3. Travel & Subsistence costs'!F:F,C34,'3. Travel & Subsistence costs'!M:M)+SUMIF('3. Travel & Subsistence costs'!F:F,C34,'3. Travel & Subsistence costs'!Q:Q)","v":0},{"$f":"SUMIF('4. Personnel  costs'!E:E,B34,'4. Personnel  costs'!W:W)","v":0},{"$f":"SUMIF('5. Indirect Costs'!B:B,B34,'5. Indirect Costs'!G:G)","v":0},0,null,{"$f":"SUMIFS('Co-financing  Income'!I:I,'Co-financing  Income'!B:B,Overview!B34,'Co-financing  Income'!E:E,'Data sources'!$L$4)","v":0},null,{"$f":"IF(OR(COUNTIF('Data sources'!$I$11:$I$193,Overview!D34)=0,Overview!C34=\"\"),\"Error\",\"\")","v":"Error"}]
[null,"P4",null,null,{"$f":"SUMIF('1. Costs linked to activities'!E:E,B35,'1. Costs linked to activities'!J:J)","v":0},{"$f":"SUMIF('2. Communication Costs'!E:E,B35,'2. Communication Costs'!J:J)","v":0},{"$f":"SUMIF('3. Travel & Subsistence costs'!F:F,C35,'3. Travel & Subsistence costs'!M:M)+SUMIF('3. Travel & Subsistence costs'!F:F,C35,'3. Travel & Subsistence costs'!Q:Q)","v":0},{"$f":"SUMIF('4. Personnel  costs'!E:E,B35,'4. Personnel  costs'!W:W)","v":0},{"$f":"SUMIF('5. Indirect Costs'!B:B,B35,'5. Indirect Costs'!G:G)","v":0},0,null,{"$f":"SUMIFS('Co-financing  Income'!I:I,'Co-financing  Income'!B:B,Overview!B35,'Co-financing  Income'!E:E,'Data sources'!$L$4)","v":0},null,{"$f":"IF(OR(COUNTIF('Data sources'!$I$11:$I$193,Overview!D35)=0,Overview!C35=\"\"),\"Error\",\"\")","v":"Error"}]
[null,"P5",null,null,{"$f":"SUMIF('1. Costs linked to activities'!E:E,B36,'1. Costs linked to activities'!J:J)","v":0},{"$f":"SUMIF('2. Communication Costs'!E:E,B36,'2. Communication Costs'!J:J)","v":0},{"$f":"SUMIF('3. Travel & Subsistence costs'!F:F,C36,'3. Travel & Subsistence costs'!M:M)+SUMIF('3. Travel & Subsistence costs'!F:F,C36,'3. Travel & Subsistence costs'!Q:Q)","v":0},{"$f":"SUMIF('4. Personnel  costs'!E:E,B36,'4. Personnel  costs'!W:W)","v":0},{"$f":"SUMIF('5. Indirect Costs'!B:B,B36,'5. Indirect Costs'!G:G)","v":0},0,null,{"$f":"SUMIFS('Co-financing  Income'!I:I,'Co-financing  Income'!B:B,Overview!B36,'Co-financing  Income'!E:E,'Data sources'!$L$4)","v":0},null,{"$f":"IF(OR(COUNTIF('Data sources'!$I$11:$I$193,Overview!D36)=0,Overview!C36=\"\"),\"Error\",\"\")","v":"Error"}]
[null,"P6",null,null,{"$f":"SUMIF('1. Costs linked to activities'!E:E,B37,'1. Costs linked to activities'!J:J)","v":0},{"$f":"SUMIF('2. Communication Costs'!E:E,B37,'2. Communication Costs'!J:J)","v":0},{"$f":"SUMIF('3. Travel & Subsistence costs'!F:F,C37,'3. Travel & Subsistence costs'!M:M)+SUMIF('3. Travel & Subsistence costs'!F:F,C37,'3. Travel & Subsistence costs'!Q:Q)","v":0},{"$f":"SUMIF('4. Personnel  costs'!E:E,B37,'4. Personnel  costs'!W:W)","v":0},{"$f":"SUMIF('5. Indirect Costs'!B:B,B37,'5. Indirect Costs'!G:G)","v":0},0,null,{"$f":"SUMIFS('Co-financing  Income'!I:I,'Co-financing  Income'!B:B,Overview!B37,'Co-financing  Income'!E:E,'Data sources'!$L$4)","v":0},null,{"$f":"IF(OR(COUNTIF('Data sources'!$I$11:$I$193,Overview!D37)=0,Overview!C37=\"\"),\"Error\",\"\")","v":"Error"}]
[null,"P7",null,null,{"$f":"SUMIF('1. Costs linked to activities'!E:E,B38,'1. Costs linked to activities'!J:J)","v":0},{"$f":"SUMIF('2. Communication Costs'!E:E,B38,'2. Communication Costs'!J:J)","v":0},{"$f":"SUMIF('3. Travel & Subsistence costs'!F:F,C38,'3. Travel & Subsistence costs'!M:M)+SUMIF('3. Travel & Subsistence costs'!F:F,C38,'3. Travel & Subsistence costs'!Q:Q)","v":0},{"$f":"SUMIF('4. Personnel  costs'!E:E,B38,'4. Personnel  costs'!W:W)","v":0},{"$f":"SUMIF('5. Indirect Costs'!B:B,B38,'5. Indirect Costs'!G:G)","v":0},0,null,{"$f":"SUMIFS('Co-financing  Income'!I:I,'Co-financing  Income'!B:B,Overview!B38,'Co-financing  Income'!E:E,'Data sources'!$L$4)","v":0},null,{"$f":"IF(OR(COUNTIF('Data sources'!$I$11:$I$193,Overview!D38)=0,Overview!C38=\"\"),\"Error\",\"\")","v":"Error"}]
[null,"P8",null,null,{"$f":"SUMIF('1. Costs linked to activities'!E:E,B39,'1. Costs linked to activities'!J:J)","v":0},{"$f":"SUMIF('2. Communication Costs'!E:E,B39,'2. Communication Costs'!J:J)","v":0},{"$f":"SUMIF('3. Travel & Subsistence costs'!F:F,C39,'3. Travel & Subsistence costs'!M:M)+SUMIF('3. Travel & Subsistence costs'!F:F,C39,'3. Travel & Subsistence costs'!Q:Q)","v":0},{"$f":"SUMIF('4. Personnel  costs'!E:E,B39,'4. Personnel  costs'!W:W)","v":0},{"$f":"SUMIF('5. Indirect Costs'!B:B,B39,'5. Indirect Costs'!G:G)","v":0},0,null,{"$f":"SUMIFS('Co-financing  Income'!I:I,'Co-financing  Income'!B:B,Overview!B39,'Co-financing  Income'!E:E,'Data sources'!$L$4)","v":0},null,{"$f":"IF(OR(COUNTIF('Data sources'!$I$11:$I$193,Overview!D39)=0,Overview!C39=\"\"),\"Error\",\"\")","v":"Error"}]
[null,"P9",null,null,{"$f":"SUMIF('1. Costs linked to activities'!E:E,B40,'1. Costs linked to activities'!J:J)","v":0},{"$f":"SUMIF('2. Communication Costs'!E:E,B40,'2. Communication Costs'!J:J)","v":0},{"$f":"SUMIF('3. Travel & Subsistence costs'!F:F,C40,'3. Travel & Subsistence costs'!M:M)+SUMIF('3. Travel & Subsistence costs'!F:F,C40,'3. Travel & Subsistence costs'!Q:Q)","v":0},{"$f":"SUMIF('4. Personnel  costs'!E:E,B40,'4. Personnel  costs'!W:W)","v":0},{"$f":"SUMIF('5. Indirect Costs'!B:B,B40,'5. Indirect Costs'!G:G)","v":0},0,null,{"$f":"SUMIFS('Co-financing  Income'!I:I,'Co-financing  Income'!B:B,Overview!B40,'Co-financing  Income'!E:E,'Data sources'!$L$4)","v":0},null,{"$f":"IF(OR(COUNTIF('Data sources'!$I$11:$I$193,Overview!D40)=0,Overview!C40=\"\"),\"Error\",\"\")","v":"Error"}]
[null,"P10",null,null,{"$f":"SUMIF('1. Costs linked to activities'!E:E,B41,'1. Costs linked to activities'!J:J)","v":0},{"$f":"SUMIF('2. Communication Costs'!E:E,B41,'2. Communication Costs'!J:J)","v":0},{"$f":"SUMIF('3. Travel & Subsistence costs'!F:F,C41,'3. Travel & Subsistence costs'!M:M)+SUMIF('3. Travel & Subsistence costs'!F:F,C41,'3. Travel & Subsistence costs'!Q:Q)","v":0},{"$f":"SUMIF('4. Personnel  costs'!E:E,B41,'4. Personnel  costs'!W:W)","v":0},{"$f":"SUMIF('5. Indirect Costs'!B:B,B41,'5. Indirect Costs'!G:G)","v":0},0,null,{"$f":"SUMIFS('Co-financing  Income'!I:I,'Co-financing  Income'!B:B,Overview!B41,'Co-financing  Income'!E:E,'Data sources'!$L$4)","v":0},null,{"$f":"IF(OR(COUNTIF('Data sources'!$I$11:$I$193,Overview!D41)=0,Overview!C41=\"\"),\"Error\",\"\")","v":"Error"}]
[null,"P11",null,null,{"$f":"SUMIF('1. Costs linked to activities'!E:E,B42,'1. Costs linked to activities'!J:J)","v":0},{"$f":"SUMIF('2. Communication Costs'!E:E,B42,'2. Communication Costs'!J:J)","v":0},{"$f":"SUMIF('3. Travel & Subsistence costs'!F:F,C42,'3. Travel & Subsistence costs'!M:M)+SUMIF('3. Travel & Subsistence costs'!F:F,C42,'3. Travel & Subsistence costs'!Q:Q)","v":0},{"$f":"SUMIF('4. Personnel  costs'!E:E,B42,'4. Personnel  costs'!W:W)","v":0},{"$f":"SUMIF('5. Indirect Costs'!B:B,B42,'5. Indirect Costs'!G:G)","v":0},0,null,{"$f":"SUMIFS('Co-financing  Income'!I:I,'Co-financing  Income'!B:B,Overview!B42,'Co-financing  Income'!E:E,'Data sources'!$L$4)","v":0},null,{"$f":"IF(OR(COUNTIF('Data sources'!$I$11:$I$193,Overview!D42)=0,Overview!C42=\"\"),\"Error\",\"\")","v":"Error"}]
[null,"P12",null,null,{"$f":"SUMIF('1. Costs linked to activities'!E:E,B43,'1. Costs linked to activities'!J:J)","v":0},{"$f":"SUMIF('2. Communication Costs'!E:E,B43,'2. Communication Costs'!J:J)","v":0},{"$f":"SUMIF('3. Travel & Subsistence costs'!F:F,C43,'3. Travel & Subsistence costs'!M:M)+SUMIF('3. Travel & Subsistence costs'!F:F,C43,'3. Travel & Subsistence costs'!Q:Q)","v":0},{"$f":"SUMIF('4. Personnel  costs'!E:E,B43,'4. Personnel  costs'!W:W)","v":0},{"$f":"SUMIF('5. Indirect Costs'!B:B,B43,'5. Indirect Costs'!G:G)","v":0},0,null,{"$f":"SUMIFS('Co-financing  Income'!I:I,'Co-financing  Income'!B:B,Overview!B43,'Co-financing  Income'!E:E,'Data sources'!$L$4)","v":0},null,{"$f":"IF(OR(COUNTIF('Data sources'!$I$11:$I$193,Overview!D43)=0,Overview!C43=\"\"),\"Error\",\"\")","v":"Error"}]
[null,"P13",null,null,{"$f":"SUMIF('1. Costs linked to activities'!E:E,B44,'1. Costs linked to activities'!J:J)","v":0},{"$f":"SUMIF('2. Communication Costs'!E:E,B44,'2. Communication Costs'!J:J)","v":0},{"$f":"SUMIF('3. Travel & Subsistence costs'!F:F,C44,'3. Travel & Subsistence costs'!M:M)+SUMIF('3. Travel & Subsistence costs'!F:F,C44,'3. Travel & Subsistence costs'!Q:Q)","v":0},{"$f":"SUMIF('4. Personnel  costs'!E:E,B44,'4. Personnel  costs'!W:W)","v":0},{"$f":"SUMIF('5. Indirect Costs'!B:B,B44,'5. Indirect Costs'!G:G)","v":0},0,null,{"$f":"SUMIFS('Co-financing  Income'!I:I,'Co-financing  Income'!B:B,Overview!B44,'Co-financing  Income'!E:E,'Data sources'!$L$4)","v":0},null,{"$f":"IF(OR(COUNTIF('Data sources'!$I$11:$I$193,Overview!D44)=0,Overview!C44=\"\"),\"Error\",\"\")","v":"Error"}]
[null,"P14",null,null,{"$f":"SUMIF('1. Costs linked to activities'!E:E,B45,'1. Costs linked to activities'!J:J)","v":0},{"$f":"SUMIF('2. Communication Costs'!E:E,B45,'2. Communication Costs'!J:J)","v":0},{"$f":"SUMIF('3. Travel & Subsistence costs'!F:F,C45,'3. Travel & Subsistence costs'!M:M)+SUMIF('3. Travel & Subsistence costs'!F:F,C45,'3. Travel & Subsistence costs'!Q:Q)","v":0},{"$f":"SUMIF('4. Personnel  costs'!E:E,B45,'4. Personnel  costs'!W:W)","v":0},{"$f":"SUMIF('5. Indirect Costs'!B:B,B45,'5. Indirect Costs'!G:G)","v":0},0,null,{"$f":"SUMIFS('Co-financing  Income'!I:I,'Co-financing  Income'!B:B,Overview!B45,'Co-financing  Income'!E:E,'Data sources'!$L$4)","v":0},null,{"$f":"IF(OR(COUNTIF('Data sources'!$I$11:$I$193,Overview!D45)=0,Overview!C45=\"\"),\"Error\",\"\")","v":"Error"}]
[null,"P15",null,null,{"$f":"SUMIF('1. Costs linked to activities'!E:E,B46,'1. Costs linked to activities'!J:J)","v":0},{"$f":"SUMIF('2. Communication Costs'!E:E,B46,'2. Communication Costs'!J:J)","v":0},{"$f":"SUMIF('3. Travel & Subsistence costs'!F:F,C46,'3. Travel & Subsistence costs'!M:M)+SUMIF('3. Travel & Subsistence costs'!F:F,C46,'3. Travel & Subsistence costs'!Q:Q)","v":0},{"$f":"SUMIF('4. Personnel  costs'!E:E,B46,'4. Personnel  costs'!W:W)","v":0},{"$f":"SUMIF('5. Indirect Costs'!B:B,B46,'5. Indirect Costs'!G:G)","v":0},0,null,{"$f":"SUMIFS('Co-financing  Income'!I:I,'Co-financing  Income'!B:B,Overview!B46,'Co-financing  Income'!E:E,'Data sources'!$L$4)","v":0},null,{"$f":"IF(OR(COUNTIF('Data sources'!$I$11:$I$193,Overview!D46)=0,Overview!C46=\"\"),\"Error\",\"\")","v":"Error"}]
[null,"P16",null,null,{"$f":"SUMIF('1. Costs linked to activities'!E:E,B47,'1. Costs linked to activities'!J:J)","v":0},{"$f":"SUMIF('2. Communication Costs'!E:E,B47,'2. Communication Costs'!J:J)","v":0},{"$f":"SUMIF('3. Travel & Subsistence costs'!F:F,C47,'3. Travel & Subsistence costs'!M:M)+SUMIF('3. Travel & Subsistence costs'!F:F,C47,'3. Travel & Subsistence costs'!Q:Q)","v":0},{"$f":"SUMIF('4. Personnel  costs'!E:E,B47,'4. Personnel  costs'!W:W)","v":0},{"$f":"SUMIF('5. Indirect Costs'!B:B,B47,'5. Indirect Costs'!G:G)","v":0},0,null,{"$f":"SUMIFS('Co-financing  Income'!I:I,'Co-financing  Income'!B:B,Overview!B47,'Co-financing  Income'!E:E,'Data sources'!$L$4)","v":0},null,{"$f":"IF(OR(COUNTIF('Data sources'!$I$11:$I$193,Overview!D47)=0,Overview!C47=\"\"),\"Error\",\"\")","v":"Error"}]
[null,"P17",null,null,{"$f":"SUMIF('1. Costs linked to activities'!E:E,B48,'1. Costs linked to activities'!J:J)","v":0},{"$f":"SUMIF('2. Communication Costs'!E:E,B48,'2. Communication Costs'!J:J)","v":0},{"$f":"SUMIF('3. Travel & Subsistence costs'!F:F,C48,'3. Travel & Subsistence costs'!M:M)+SUMIF('3. Travel & Subsistence costs'!F:F,C48,'3. Travel & Subsistence costs'!Q:Q)","v":0},{"$f":"SUMIF('4. Personnel  costs'!E:E,B48,'4. Personnel  costs'!W:W)","v":0},{"$f":"SUMIF('5. Indirect Costs'!B:B,B48,'5. Indirect Costs'!G:G)","v":0},0,null,{"$f":"SUMIFS('Co-financing  Income'!I:I,'Co-financing  Income'!B:B,Overview!B48,'Co-financing  Income'!E:E,'Data sources'!$L$4)","v":0},null,{"$f":"IF(OR(COUNTIF('Data sources'!$I$11:$I$193,Overview!D48)=0,Overview!C48=\"\"),\"Error\",\"\")","v":"Error"}]
[null,"P18",null,null,{"$f":"SUMIF('1. Costs linked to activities'!E:E,B49,'1. Costs linked to activities'!J:J)","v":0},{"$f":"SUMIF('2. Communication Costs'!E:E,B49,'2. Communication Costs'!J:J)","v":0},{"$f":"SUMIF('3. Travel & Subsistence costs'!F:F,C49,'3. Travel & Subsistence costs'!M:M)+SUMIF('3. Travel & Subsistence costs'!F:F,C49,'3. Travel & Subsistence costs'!Q:Q)","v":0},{"$f":"SUMIF('4. Personnel  costs'!E:E,B49,'4. Personnel  costs'!W:W)","v":0},{"$f":"SUMIF('5. Indirect Costs'!B:B,B49,'5. Indirect Costs'!G:G)","v":0},0,null,{"$f":"SUMIFS('Co-financing  Income'!I:I,'Co-financing  Income'!B:B,Overview!B49,'Co-financing  Income'!E:E,'Data sources'!$L$4)","v":0},null,{"$f":"IF(OR(COUNTIF('Data sources'!$I$11:$I$193,Overview!D49)=0,Overview!C49=\"\"),\"Error\",\"\")","v":"Error"}]
[null,"P19",null,null,{"$f":"SUMIF('1. Costs linked to activities'!E:E,B50,'1. Costs linked to activities'!J:J)","v":0},{"$f":"SUMIF('2. Communication Costs'!E:E,B50,'2. Communication Costs'!J:J)","v":0},{"$f":"SUMIF('3. Travel & Subsistence costs'!F:F,C50,'3. Travel & Subsistence costs'!M:M)+SUMIF('3. Travel & Subsistence costs'!F:F,C50,'3. Travel & Subsistence costs'!Q:Q)","v":0},{"$f":"SUMIF('4. Personnel  costs'!E:E,B50,'4. Personnel  costs'!W:W)","v":0},{"$f":"SUMIF('5. Indirect Costs'!B:B,B50,'5. Indirect Costs'!G:G)","v":0},0,null,{"$f":"SUMIFS('Co-financing  Income'!I:I,'Co-financing  Income'!B:B,Overview!B50,'Co-financing  Income'!E:E,'Data sources'!$L$4)","v":0},null,{"$f":"IF(OR(COUNTIF('Data sources'!$I$11:$I$193,Overview!D50)=0,Overview!C50=\"\"),\"Error\",\"\")","v":"Error"}]
[null,"P20",null,null,{"$f":"SUMIF('1. Costs linked to activities'!E:E,B51,'1. Costs linked to activities'!J:J)","v":0},{"$f":"SUMIF('2. Communication Costs'!E:E,B51,'2. Communication Costs'!J:J)","v":0},{"$f":"SUMIF('3. Travel & Subsistence costs'!F:F,C51,'3. Travel & Subsistence costs'!M:M)+SUMIF('3. Travel & Subsistence costs'!F:F,C51,'3. Travel & Subsistence costs'!Q:Q)","v":0},{"$f":"SUMIF('4. Personnel  costs'!E:E,B51,'4. Personnel  costs'!W:W)","v":0},{"$f":"SUMIF('5. Indirect Costs'!B:B,B51,'5. Indirect Costs'!G:G)","v":0},0,null,{"$f":"SUMIFS('Co-financing  Income'!I:I,'Co-financing  Income'!B:B,Overview!B51,'Co-financing  Income'!E:E,'Data sources'!$L$4)","v":0},null,{"$f":"IF(OR(COUNTIF('Data sources'!$I$11:$I$193,Overview!D51)=0,Overview!C51=\"\"),\"Error\",\"\")","v":"Error"}]
[null,"P21",null,null,{"$f":"SUMIF('1. Costs linked to activities'!E:E,B52,'1. Costs linked to activities'!J:J)","v":0},{"$f":"SUMIF('2. Communication Costs'!E:E,B52,'2. Communication Costs'!J:J)","v":0},{"$f":"SUMIF('3. Travel & Subsistence costs'!F:F,C52,'3. Travel & Subsistence costs'!M:M)+SUMIF('3. Travel & Subsistence costs'!F:F,C52,'3. Travel & Subsistence costs'!Q:Q)","v":0},{"$f":"SUMIF('4. Personnel  costs'!E:E,B52,'4. Personnel  costs'!W:W)","v":0},{"$f":"SUMIF('5. Indirect Costs'!B:B,B52,'5. Indirect Costs'!G:G)","v":0},0,null,{"$f":"SUMIFS('Co-financing  Income'!I:I,'Co-financing  Income'!B:B,Overview!B52,'Co-financing  Income'!E:E,'Data sources'!$L$4)","v":0},null,{"$f":"IF(OR(COUNTIF('Data sources'!$I$11:$I$193,Overview!D52)=0,Overview!C52=\"\"),\"Error\",\"\")","v":"Error"}]
[null,"P22",null,null,{"$f":"SUMIF('1. Costs linked to activities'!E:E,B53,'1. Costs linked to activities'!J:J)","v":0},{"$f":"SUMIF('2. Communication Costs'!E:E,B53,'2. Communication Costs'!J:J)","v":0},{"$f":"SUMIF('3. Travel & Subsistence costs'!F:F,C53,'3. Travel & Subsistence costs'!M:M)+SUMIF('3. Travel & Subsistence costs'!F:F,C53,'3. Travel & Subsistence costs'!Q:Q)","v":0},{"$f":"SUMIF('4. Personnel  costs'!E:E,B53,'4. Personnel  costs'!W:W)","v":0},{"$f":"SUMIF('5. Indirect Costs'!B:B,B53,'5. Indirect Costs'!G:G)","v":0},0,null,{"$f":"SUMIFS('Co-financing  Income'!I:I,'Co-financing  Income'!B:B,Overview!B53,'Co-financing  Income'!E:E,'Data sources'!$L$4)","v":0},null,{"$f":"IF(OR(COUNTIF('Data sources'!$I$11:$I$193,Overview!D53)=0,Overview!C53=\"\"),\"Error\",\"\")","v":"Error"}]
[null,"P23",null,null,{"$f":"SUMIF('1. Costs linked to activities'!E:E,B54,'1. Costs linked to activities'!J:J)","v":0},{"$f":"SUMIF('2. Communication Costs'!E:E,B54,'2. Communication Costs'!J:J)","v":0},{"$f":"SUMIF('3. Travel & Subsistence costs'!F:F,C54,'3. Travel & Subsistence costs'!M:M)+SUMIF('3. Travel & Subsistence costs'!F:F,C54,'3. Travel & Subsistence costs'!Q:Q)","v":0},{"$f":"SUMIF('4. Personnel  costs'!E:E,B54,'4. Personnel  costs'!W:W)","v":0},{"$f":"SUMIF('5. Indirect Costs'!B:B,B54,'5. Indirect Costs'!G:G)","v":0},0,null,{"$f":"SUMIFS('Co-financing  Income'!I:I,'Co-financing  Income'!B:B,Overview!B54,'Co-financing  Income'!E:E,'Data sources'!$L$4)","v":0},null,{"$f":"IF(OR(COUNTIF('Data sources'!$I$11:$I$193,Overview!D54)=0,Overview!C54=\"\"),\"Error\",\"\")","v":"Error"}]
[null,"P24",null,null,{"$f":"SUMIF('1. Costs linked to activities'!E:E,B55,'1. Costs linked to activities'!J:J)","v":0},{"$f":"SUMIF('2. Communication Costs'!E:E,B55,'2. Communication Costs'!J:J)","v":0},{"$f":"SUMIF('3. Travel & Subsistence costs'!F:F,C55,'3. Travel & Subsistence costs'!M:M)+SUMIF('3. Travel & Subsistence costs'!F:F,C55,'3. Travel & Subsistence costs'!Q:Q)","v":0},{"$f":"SUMIF('4. Personnel  costs'!E:E,B55,'4. Personnel  costs'!W:W)","v":0},{"$f":"SUMIF('5. Indirect Costs'!B:B,B55,'5. Indirect Costs'!G:G)","v":0},0,null,{"$f":"SUMIFS('Co-financing  Income'!I:I,'Co-financing  Income'!B:B,Overview!B55,'Co-financing  Income'!E:E,'Data sources'!$L$4)","v":0},null,{"$f":"IF(OR(COUNTIF('Data sources'!$I$11:$I$193,Overview!D55)=0,Overview!C55=\"\"),\"Error\",\"\")","v":"Error"}]
[null,"P25",null,null,{"$f":"SUMIF('1. Costs linked to activities'!E:E,B56,'1. Costs linked to activities'!J:J)","v":0},{"$f":"SUMIF('2. Communication Costs'!E:E,B56,'2. Communication Costs'!J:J)","v":0},{"$f":"SUMIF('3. Travel & Subsistence costs'!F:F,C56,'3. Travel & Subsistence costs'!M:M)+SUMIF('3. Travel & Subsistence costs'!F:F,C56,'3. Travel & Subsistence costs'!Q:Q)","v":0},{"$f":"SUMIF('4. Personnel  costs'!E:E,B56,'4. Personnel  costs'!W:W)","v":0},{"$f":"SUMIF('5. Indirect Costs'!B:B,B56,'5. Indirect Costs'!G:G)","v":0},0,null,{"$f":"SUMIFS('Co-financing  Income'!I:I,'Co-financing  Income'!B:B,Overview!B56,'Co-financing  Income'!E:E,'Data sources'!$L$4)","v":0},null,{"$f":"IF(OR(COUNTIF('Data sources'!$I$11:$I$193,Overview!D56)=0,Overview!C56=\"\"),\"Error\",\"\")","v":"Error"}]
[null,"P26",null,null,{"$f":"SUMIF('1. Costs linked to activities'!E:E,B57,'1. Costs linked to activities'!J:J)","v":0},{"$f":"SUMIF('2. Communication Costs'!E:E,B57,'2. Communication Costs'!J:J)","v":0},{"$f":"SUMIF('3. Travel & Subsistence costs'!F:F,C57,'3. Travel & Subsistence costs'!M:M)+SUMIF('3. Travel & Subsistence costs'!F:F,C57,'3. Travel & Subsistence costs'!Q:Q)","v":0},{"$f":"SUMIF('4. Personnel  costs'!E:E,B57,'4. Personnel  costs'!W:W)","v":0},{"$f":"SUMIF('5. Indirect Costs'!B:B,B57,'5. Indirect Costs'!G:G)","v":0},0,null,{"$f":"SUMIFS('Co-financing  Income'!I:I,'Co-financing  Income'!B:B,Overview!B57,'Co-financing  Income'!E:E,'Data sources'!$L$4)","v":0},null,{"$f":"IF(OR(COUNTIF('Data sources'!$I$11:$I$193,Overview!D57)=0,Overview!C57=\"\"),\"Error\",\"\")","v":"Error"}]
[null,"P27",null,null,{"$f":"SUMIF('1. Costs linked to activities'!E:E,B58,'1. Costs linked to activities'!J:J)","v":0},{"$f":"SUMIF('2. Communication Costs'!E:E,B58,'2. Communication Costs'!J:J)","v":0},{"$f":"SUMIF('3. Travel & Subsistence costs'!F:F,C58,'3. Travel & Subsistence costs'!M:M)+SUMIF('3. Travel & Subsistence costs'!F:F,C58,'3. Travel & Subsistence costs'!Q:Q)","v":0},{"$f":"SUMIF('4. Personnel  costs'!E:E,B58,'4. Personnel  costs'!W:W)","v":0},{"$f":"SUMIF('5. Indirect Costs'!B:B,B58,'5. Indirect Costs'!G:G)","v":0},0,null,{"$f":"SUMIFS('Co-financing  Income'!I:I,'Co-financing  Income'!B:B,Overview!B58,'Co-financing  Income'!E:E,'Data sources'!$L$4)","v":0},null,{"$f":"IF(OR(COUNTIF('Data sources'!$I$11:$I$193,Overview!D58)=0,Overview!C58=\"\"),\"Error\",\"\")","v":"Error"}]
[null,"P28",null,null,{"$f":"SUMIF('1. Costs linked to activities'!E:E,B59,'1. Costs linked to activities'!J:J)","v":0},{"$f":"SUMIF('2. Communication Costs'!E:E,B59,'2. Communication Costs'!J:J)","v":0},{"$f":"SUMIF('3. Travel & Subsistence costs'!F:F,C59,'3. Travel & Subsistence costs'!M:M)+SUMIF('3. Travel & Subsistence costs'!F:F,C59,'3. Travel & Subsistence costs'!Q:Q)","v":0},{"$f":"SUMIF('4. Personnel  costs'!E:E,B59,'4. Personnel  costs'!W:W)","v":0},{"$f":"SUMIF('5. Indirect Costs'!B:B,B59,'5. Indirect Costs'!G:G)","v":0},0,null,{"$f":"SUMIFS('Co-financing  Income'!I:I,'Co-financing  Income'!B:B,Overview!B59,'Co-financing  Income'!E:E,'Data sources'!$L$4)","v":0},null,{"$f":"IF(OR(COUNTIF('Data sources'!$I$11:$I$193,Overview!D59)=0,Overview!C59=\"\"),\"Error\",\"\")","v":"Error"}]
[null,"P29",null,null,{"$f":"SUMIF('1. Costs linked to activities'!E:E,B60,'1. Costs linked to activities'!J:J)","v":0},{"$f":"SUMIF('2. Communication Costs'!E:E,B60,'2. Communication Costs'!J:J)","v":0},{"$f":"SUMIF('3. Travel & Subsistence costs'!F:F,C60,'3. Travel & Subsistence costs'!M:M)+SUMIF('3. Travel & Subsistence costs'!F:F,C60,'3. Travel & Subsistence costs'!Q:Q)","v":0},{"$f":"SUMIF('4. Personnel  costs'!E:E,B60,'4. Personnel  costs'!W:W)","v":0},{"$f":"SUMIF('5. Indirect Costs'!B:B,B60,'5. Indirect Costs'!G:G)","v":0},0,null,{"$f":"SUMIFS('Co-financing  Income'!I:I,'Co-financing  Income'!B:B,Overview!B60,'Co-financing  Income'!E:E,'Data sources'!$L$4)","v":0},null,{"$f":"IF(OR(COUNTIF('Data sources'!$I$11:$I$193,Overview!D60)=0,Overview!C60=\"\"),\"Error\",\"\")","v":"Error"}]
[null,"P30",null,null,{"$f":"SUMIF('1. Costs linked to activities'!E:E,B61,'1. Costs linked to activities'!J:J)","v":0},{"$f":"SUMIF('2. Communication Costs'!E:E,B61,'2. Communication Costs'!J:J)","v":0},{"$f":"SUMIF('3. Travel & Subsistence costs'!F:F,C61,'3. Travel & Subsistence costs'!M:M)+SUMIF('3. Travel & Subsistence costs'!F:F,C61,'3. Travel & Subsistence costs'!Q:Q)","v":0},{"$f":"SUMIF('4. Personnel  costs'!E:E,B61,'4. Personnel  costs'!W:W)","v":0},{"$f":"SUMIF('5. Indirect Costs'!B:B,B61,'5. Indirect Costs'!G:G)","v":0},0,null,{"$f":"SUMIFS('Co-financing  Income'!I:I,'Co-financing  Income'!B:B,Overview!B61,'Co-financing  Income'!E:E,'Data sources'!$L$4)","v":0},null,{"$f":"IF(OR(COUNTIF('Data sources'!$I$11:$I$193,Overview!D61)=0,Overview!C61=\"\"),\"Error\",\"\")","v":"Error"}]
[null,"P31",null,null,{"$f":"SUMIF('1. Costs linked to activities'!E:E,B62,'1. Costs linked to activities'!J:J)","v":0},{"$f":"SUMIF('2. Communication Costs'!E:E,B62,'2. Communication Costs'!J:J)","v":0},{"$f":"SUMIF('3. Travel & Subsistence costs'!F:F,C62,'3. Travel & Subsistence costs'!M:M)+SUMIF('3. Travel & Subsistence costs'!F:F,C62,'3. Travel & Subsistence costs'!Q:Q)","v":0},{"$f":"SUMIF('4. Personnel  costs'!E:E,B62,'4. Personnel  costs'!W:W)","v":0},{"$f":"SUMIF('5. Indirect Costs'!B:B,B62,'5. Indirect Costs'!G:G)","v":0},0,null,{"$f":"SUMIFS('Co-financing  Income'!I:I,'Co-financing  Income'!B:B,Overview!B62,'Co-financing  Income'!E:E,'Data sources'!$L$4)","v":0},null,{"$f":"IF(OR(COUNTIF('Data sources'!$I$11:$I$193,Overview!D62)=0,Overview!C62=\"\"),\"Error\",\"\")","v":"Error"}]
[null,"P32",null,null,{"$f":"SUMIF('1. Costs linked to activities'!E:E,B63,'1. Costs linked to activities'!J:J)","v":0},{"$f":"SUMIF('2. Communication Costs'!E:E,B63,'2. Communication Costs'!J:J)","v":0},{"$f":"SUMIF('3. Travel & Subsistence costs'!F:F,C63,'3. Travel & Subsistence costs'!M:M)+SUMIF('3. Travel & Subsistence costs'!F:F,C63,'3. Travel & Subsistence costs'!Q:Q)","v":0},{"$f":"SUMIF('4. Personnel  costs'!E:E,B63,'4. Personnel  costs'!W:W)","v":0},{"$f":"SUMIF('5. Indirect Costs'!B:B,B63,'5. Indirect Costs'!G:G)","v":0},0,null,{"$f":"SUMIFS('Co-financing  Income'!I:I,'Co-financing  Income'!B:B,Overview!B63,'Co-financing  Income'!E:E,'Data sources'!$L$4)","v":0},null,{"$f":"IF(OR(COUNTIF('Data sources'!$I$11:$I$193,Overview!D63)=0,Overview!C63=\"\"),\"Error\",\"\")","v":"Error"}]
[null,"P33",null,null,{"$f":"SUMIF('1. Costs linked to activities'!E:E,B64,'1. Costs linked to activities'!J:J)","v":0},{"$f":"SUMIF('2. Communication Costs'!E:E,B64,'2. Communication Costs'!J:J)","v":0},{"$f":"SUMIF('3. Travel & Subsistence costs'!F:F,C64,'3. Travel & Subsistence costs'!M:M)+SUMIF('3. Travel & Subsistence costs'!F:F,C64,'3. Travel & Subsistence costs'!Q:Q)","v":0},{"$f":"SUMIF('4. Personnel  costs'!E:E,B64,'4. Personnel  costs'!W:W)","v":0},{"$f":"SUMIF('5. Indirect Costs'!B:B,B64,'5. Indirect Costs'!G:G)","v":0},0,null,{"$f":"SUMIFS('Co-financing  Income'!I:I,'Co-financing  Income'!B:B,Overview!B64,'Co-financing  Income'!E:E,'Data sources'!$L$4)","v":0},null,{"$f":"IF(OR(COUNTIF('Data sources'!$I$11:$I$193,Overview!D64)=0,Overview!C64=\"\"),\"Error\",\"\")","v":"Error"}]
[null,"P34",null,null,{"$f":"SUMIF('1. Costs linked to activities'!E:E,B65,'1. Costs linked to activities'!J:J)","v":0},{"$f":"SUMIF('2. Communication Costs'!E:E,B65,'2. Communication Costs'!J:J)","v":0},{"$f":"SUMIF('3. Travel & Subsistence costs'!F:F,C65,'3. Travel & Subsistence costs'!M:M)+SUMIF('3. Travel & Subsistence costs'!F:F,C65,'3. Travel & Subsistence costs'!Q:Q)","v":0},{"$f":"SUMIF('4. Personnel  costs'!E:E,B65,'4. Personnel  costs'!W:W)","v":0},{"$f":"SUMIF('5. Indirect Costs'!B:B,B65,'5. Indirect Costs'!G:G)","v":0},0,null,{"$f":"SUMIFS('Co-financing  Income'!I:I,'Co-financing  Income'!B:B,Overview!B65,'Co-financing  Income'!E:E,'Data sources'!$L$4)","v":0},null,{"$f":"IF(OR(COUNTIF('Data sources'!$I$11:$I$193,Overview!D65)=0,Overview!C65=\"\"),\"Error\",\"\")","v":"Error"}]
[null,"P35",null,null,{"$f":"SUMIF('1. Costs linked to activities'!E:E,B66,'1. Costs linked to activities'!J:J)","v":0},{"$f":"SUMIF('2. Communication Costs'!E:E,B66,'2. Communication Costs'!J:J)","v":0},{"$f":"SUMIF('3. Travel & Subsistence costs'!F:F,C66,'3. Travel & Subsistence costs'!M:M)+SUMIF('3. Travel & Subsistence costs'!F:F,C66,'3. Travel & Subsistence costs'!Q:Q)","v":0},{"$f":"SUMIF('4. Personnel  costs'!E:E,B66,'4. Personnel  costs'!W:W)","v":0},{"$f":"SUMIF('5. Indirect Costs'!B:B,B66,'5. Indirect Costs'!G:G)","v":0},0,null,{"$f":"SUMIFS('Co-financing  Income'!I:I,'Co-financing  Income'!B:B,Overview!B66,'Co-financing  Income'!E:E,'Data sources'!$L$4)","v":0},null,{"$f":"IF(OR(COUNTIF('Data sources'!$I$11:$I$193,Overview!D66)=0,Overview!C66=\"\"),\"Error\",\"\")","v":"Error"}]
[null,"P36",null,null,{"$f":"SUMIF('1. Costs linked to activities'!E:E,B67,'1. Costs linked to activities'!J:J)","v":0},{"$f":"SUMIF('2. Communication Costs'!E:E,B67,'2. Communication Costs'!J:J)","v":0},{"$f":"SUMIF('3. Travel & Subsistence costs'!F:F,C67,'3. Travel & Subsistence costs'!M:M)+SUMIF('3. Travel & Subsistence costs'!F:F,C67,'3. Travel & Subsistence costs'!Q:Q)","v":0},{"$f":"SUMIF('4. Personnel  costs'!E:E,B67,'4. Personnel  costs'!W:W)","v":0},{"$f":"SUMIF('5. Indirect Costs'!B:B,B67,'5. Indirect Costs'!G:G)","v":0},0,null,{"$f":"SUMIFS('Co-financing  Income'!I:I,'Co-financing  Income'!B:B,Overview!B67,'Co-financing  Income'!E:E,'Data sources'!$L$4)","v":0},null,{"$f":"IF(OR(COUNTIF('Data sources'!$I$11:$I$193,Overview!D67)=0,Overview!C67=\"\"),\"Error\",\"\")","v":"Error"}]
[null,"P37",null,null,{"$f":"SUMIF('1. Costs linked to activities'!E:E,B68,'1. Costs linked to activities'!J:J)","v":0},{"$f":"SUMIF('2. Communication Costs'!E:E,B68,'2. Communication Costs'!J:J)","v":0},{"$f":"SUMIF('3. Travel & Subsistence costs'!F:F,C68,'3. Travel & Subsistence costs'!M:M)+SUMIF('3. Travel & Subsistence costs'!F:F,C68,'3. Travel & Subsistence costs'!Q:Q)","v":0},{"$f":"SUMIF('4. Personnel  costs'!E:E,B68,'4. Personnel  costs'!W:W)","v":0},{"$f":"SUMIF('5. Indirect Costs'!B:B,B68,'5. Indirect Costs'!G:G)","v":0},0,null,{"$f":"SUMIFS('Co-financing  Income'!I:I,'Co-financing  Income'!B:B,Overview!B68,'Co-financing  Income'!E:E,'Data sources'!$L$4)","v":0},null,{"$f":"IF(OR(COUNTIF('Data sources'!$I$11:$I$193,Overview!D68)=0,Overview!C68=\"\"),\"Error\",\"\")","v":"Error"}]
[null,"P38",null,null,{"$f":"SUMIF('1. Costs linked to activities'!E:E,B69,'1. Costs linked to activities'!J:J)","v":0},{"$f":"SUMIF('2. Communication Costs'!E:E,B69,'2. Communication Costs'!J:J)","v":0},{"$f":"SUMIF('3. Travel & Subsistence costs'!F:F,C69,'3. Travel & Subsistence costs'!M:M)+SUMIF('3. Travel & Subsistence costs'!F:F,C69,'3. Travel & Subsistence costs'!Q:Q)","v":0},{"$f":"SUMIF('4. Personnel  costs'!E:E,B69,'4. Personnel  costs'!W:W)","v":0},{"$f":"SUMIF('5. Indirect Costs'!B:B,B69,'5. Indirect Costs'!G:G)","v":0},0,null,{"$f":"SUMIFS('Co-financing  Income'!I:I,'Co-financing  Income'!B:B,Overview!B69,'Co-financing  Income'!E:E,'Data sources'!$L$4)","v":0},null,{"$f":"IF(OR(COUNTIF('Data sources'!$I$11:$I$193,Overview!D69)=0,Overview!C69=\"\"),\"Error\",\"\")","v":"Error"}]
[null,"P39",null,null,{"$f":"SUMIF('1. Costs linked to activities'!E:E,B70,'1. Costs linked to activities'!J:J)","v":0},{"$f":"SUMIF('2. Communication Costs'!E:E,B70,'2. Communication Costs'!J:J)","v":0},{"$f":"SUMIF('3. Travel & Subsistence costs'!F:F,C70,'3. Travel & Subsistence costs'!M:M)+SUMIF('3. Travel & Subsistence costs'!F:F,C70,'3. Travel & Subsistence costs'!Q:Q)","v":0},{"$f":"SUMIF('4. Personnel  costs'!E:E,B70,'4. Personnel  costs'!W:W)","v":0},{"$f":"SUMIF('5. Indirect Costs'!B:B,B70,'5. Indirect Costs'!G:G)","v":0},0,null,{"$f":"SUMIFS('Co-financing  Income'!I:I,'Co-financing  Income'!B:B,Overview!B70,'Co-financing  Income'!E:E,'Data sources'!$L$4)","v":0},null,{"$f":"IF(OR(COUNTIF('Data sources'!$I$11:$I$193,Overview!D70)=0,Overview!C70=\"\"),\"Error\",\"\")","v":"Error"}]
[null,"P40",null,null,{"$f":"SUMIF('1. Costs linked to activities'!E:E,B71,'1. Costs linked to activities'!J:J)","v":0},{"$f":"SUMIF('2. Communication Costs'!E:E,B71,'2. Communication Costs'!J:J)","v":0},{"$f":"SUMIF('3. Travel & Subsistence costs'!F:F,C71,'3. Travel & Subsistence costs'!M:M)+SUMIF('3. Travel & Subsistence costs'!F:F,C71,'3. Travel & Subsistence costs'!Q:Q)","v":0},{"$f":"SUMIF('4. Personnel  costs'!E:E,B71,'4. Personnel  costs'!W:W)","v":0},{"$f":"SUMIF('5. Indirect Costs'!B:B,B71,'5. Indirect Costs'!G:G)","v":0},0,null,{"$f":"SUMIFS('Co-financing  Income'!I:I,'Co-financing  Income'!B:B,Overview!B71,'Co-financing  Income'!E:E,'Data sources'!$L$4)","v":0},null,{"$f":"IF(OR(COUNTIF('Data sources'!$I$11:$I$193,Overview!D71)=0,Overview!C71=\"\"),\"Error\",\"\")","v":"Error"}]
[null,"P41",null,null,{"$f":"SUMIF('1. Costs linked to activities'!E:E,B72,'1. Costs linked to activities'!J:J)","v":0},{"$f":"SUMIF('2. Communication Costs'!E:E,B72,'2. Communication Costs'!J:J)","v":0},{"$f":"SUMIF('3. Travel & Subsistence costs'!F:F,C72,'3. Travel & Subsistence costs'!M:M)+SUMIF('3. Travel & Subsistence costs'!F:F,C72,'3. Travel & Subsistence costs'!Q:Q)","v":0},{"$f":"SUMIF('4. Personnel  costs'!E:E,B72,'4. Personnel  costs'!W:W)","v":0},{"$f":"SUMIF('5. Indirect Costs'!B:B,B72,'5. Indirect Costs'!G:G)","v":0},0,null,{"$f":"SUMIFS('Co-financing  Income'!I:I,'Co-financing  Income'!B:B,Overview!B72,'Co-financing  Income'!E:E,'Data sources'!$L$4)","v":0},null,{"$f":"IF(OR(COUNTIF('Data sources'!$I$11:$I$193,Overview!D72)=0,Overview!C72=\"\"),\"Error\",\"\")","v":"Error"}]
[null,"P42",null,null,{"$f":"SUMIF('1. Costs linked to activities'!E:E,B73,'1. Costs linked to activities'!J:J)","v":0},{"$f":"SUMIF('2. Communication Costs'!E:E,B73,'2. Communication Costs'!J:J)","v":0},{"$f":"SUMIF('3. Travel & Subsistence costs'!F:F,C73,'3. Travel & Subsistence costs'!M:M)+SUMIF('3. Travel & Subsistence costs'!F:F,C73,'3. Travel & Subsistence costs'!Q:Q)","v":0},{"$f":"SUMIF('4. Personnel  costs'!E:E,B73,'4. Personnel  costs'!W:W)","v":0},{"$f":"SUMIF('5. Indirect Costs'!B:B,B73,'5. Indirect Costs'!G:G)","v":0},0,null,{"$f":"SUMIFS('Co-financing  Income'!I:I,'Co-financing  Income'!B:B,Overview!B73,'Co-financing  Income'!E:E,'Data sources'!$L$4)","v":0},null,{"$f":"IF(OR(COUNTIF('Data sources'!$I$11:$I$193,Overview!D73)=0,Overview!C73=\"\"),\"Error\",\"\")","v":"Error"}]
[null,"P43",null,null,{"$f":"SUMIF('1. Costs linked to activities'!E:E,B74,'1. Costs linked to activities'!J:J)","v":0},{"$f":"SUMIF('2. Communication Costs'!E:E,B74,'2. Communication Costs'!J:J)","v":0},{"$f":"SUMIF('3. Travel & Subsistence costs'!F:F,C74,'3. Travel & Subsistence costs'!M:M)+SUMIF('3. Travel & Subsistence costs'!F:F,C74,'3. Travel & Subsistence costs'!Q:Q)","v":0},{"$f":"SUMIF('4. Personnel  costs'!E:E,B74,'4. Personnel  costs'!W:W)","v":0},{"$f":"SUMIF('5. Indirect Costs'!B:B,B74,'5. Indirect Costs'!G:G)","v":0},0,null,{"$f":"SUMIFS('Co-financing  Income'!I:I,'Co-financing  Income'!B:B,Overview!B74,'Co-financing  Income'!E:E,'Data sources'!$L$4)","v":0},null,{"$f":"IF(OR(COUNTIF('Data sources'!$I$11:$I$193,Overview!D74)=0,Overview!C74=\"\"),\"Error\",\"\")","v":"Error"}]
[null,"P44",null,null,{"$f":"SUMIF('1. Costs linked to activities'!E:E,B75,'1. Costs linked to activities'!J:J)","v":0},{"$f":"SUMIF('2. Communication Costs'!E:E,B75,'2. Communication Costs'!J:J)","v":0},{"$f":"SUMIF('3. Travel & Subsistence costs'!F:F,C75,'3. Travel & Subsistence costs'!M:M)+SUMIF('3. Travel & Subsistence costs'!F:F,C75,'3. Travel & Subsistence costs'!Q:Q)","v":0},{"$f":"SUMIF('4. Personnel  costs'!E:E,B75,'4. Personnel  costs'!W:W)","v":0},{"$f":"SUMIF('5. Indirect Costs'!B:B,B75,'5. Indirect Costs'!G:G)","v":0},0,null,{"$f":"SUMIFS('Co-financing  Income'!I:I,'Co-financing  Income'!B:B,Overview!B75,'Co-financing  Income'!E:E,'Data sources'!$L$4)","v":0},null,{"$f":"IF(OR(COUNTIF('Data sources'!$I$11:$I$193,Overview!D75)=0,Overview!C75=\"\"),\"Error\",\"\")","v":"Error"}]
[null,"P45",null,null,{"$f":"SUMIF('1. Costs linked to activities'!E:E,B76,'1. Costs linked to activities'!J:J)","v":0},{"$f":"SUMIF('2. Communication Costs'!E:E,B76,'2. Communication Costs'!J:J)","v":0},{"$f":"SUMIF('3. Travel & Subsistence costs'!F:F,C76,'3. Travel & Subsistence costs'!M:M)+SUMIF('3. Travel & Subsistence costs'!F:F,C76,'3. Travel & Subsistence costs'!Q:Q)","v":0},{"$f":"SUMIF('4. Personnel  costs'!E:E,B76,'4. Personnel  costs'!W:W)","v":0},{"$f":"SUMIF('5. Indirect Costs'!B:B,B76,'5. Indirect Costs'!G:G)","v":0},0,null,{"$f":"SUMIFS('Co-financing  Income'!I:I,'Co-financing  Income'!B:B,Overview!B76,'Co-financing  Income'!E:E,'Data sources'!$L$4)","v":0},null,{"$f":"IF(OR(COUNTIF('Data sources'!$I$11:$I$193,Overview!D76)=0,Overview!C76=\"\"),\"Error\",\"\")","v":"Error"}]
[null,"P46",null,null,{"$f":"SUMIF('1. Costs linked to activities'!E:E,B77,'1. Costs linked to activities'!J:J)","v":0},{"$f":"SUMIF('2. Communication Costs'!E:E,B77,'2. Communication Costs'!J:J)","v":0},{"$f":"SUMIF('3. Travel & Subsistence costs'!F:F,C77,'3. Travel & Subsistence costs'!M:M)+SUMIF('3. Travel & Subsistence costs'!F:F,C77,'3. Travel & Subsistence costs'!Q:Q)","v":0},{"$f":"SUMIF('4. Personnel  costs'!E:E,B77,'4. Personnel  costs'!W:W)","v":0},{"$f":"SUMIF('5. Indirect Costs'!B:B,B77,'5. Indirect Costs'!G:G)","v":0},0,null,{"$f":"SUMIFS('Co-financing  Income'!I:I,'Co-financing  Income'!B:B,Overview!B77,'Co-financing  Income'!E:E,'Data sources'!$L$4)","v":0},null,{"$f":"IF(OR(COUNTIF('Data sources'!$I$11:$I$193,Overview!D77)=0,Overview!C77=\"\"),\"Error\",\"\")","v":"Error"}]
[null,"P47",null,null,{"$f":"SUMIF('1. Costs linked to activities'!E:E,B78,'1. Costs linked to activities'!J:J)","v":0},{"$f":"SUMIF('2. Communication Costs'!E:E,B78,'2. Communication Costs'!J:J)","v":0},{"$f":"SUMIF('3. Travel & Subsistence costs'!F:F,C78,'3. Travel & Subsistence costs'!M:M)+SUMIF('3. Travel & Subsistence costs'!F:F,C78,'3. Travel & Subsistence costs'!Q:Q)","v":0},{"$f":"SUMIF('4. Personnel  costs'!E:E,B78,'4. Personnel  costs'!W:W)","v":0},{"$f":"SUMIF('5. Indirect Costs'!B:B,B78,'5. Indirect Costs'!G:G)","v":0},0,null,{"$f":"SUMIFS('Co-financing  Income'!I:I,'Co-financing  Income'!B:B,Overview!B78,'Co-financing  Income'!E:E,'Data sources'!$L$4)","v":0},null,{"$f":"IF(OR(COUNTIF('Data sources'!$I$11:$I$193,Overview!D78)=0,Overview!C78=\"\"),\"Error\",\"\")","v":"Error"}]
[null,"P48",null,null,{"$f":"SUMIF('1. Costs linked to activities'!E:E,B79,'1. Costs linked to activities'!J:J)","v":0},{"$f":"SUMIF('2. Communication Costs'!E:E,B79,'2. Communication Costs'!J:J)","v":0},{"$f":"SUMIF('3. Travel & Subsistence costs'!F:F,C79,'3. Travel & Subsistence costs'!M:M)+SUMIF('3. Travel & Subsistence costs'!F:F,C79,'3. Travel & Subsistence costs'!Q:Q)","v":0},{"$f":"SUMIF('4. Personnel  costs'!E:E,B79,'4. Personnel  costs'!W:W)","v":0},{"$f":"SUMIF('5. Indirect Costs'!B:B,B79,'5. Indirect Costs'!G:G)","v":0},0,null,{"$f":"SUMIFS('Co-financing  Income'!I:I,'Co-financing  Income'!B:B,Overview!B79,'Co-financing  Income'!E:E,'Data sources'!$L$4)","v":0},null,{"$f":"IF(OR(COUNTIF('Data sources'!$I$11:$I$193,Overview!D79)=0,Overview!C79=\"\"),\"Error\",\"\")","v":"Error"}]
[null,"P49",null,null,{"$f":"SUMIF('1. Costs linked to activities'!E:E,B80,'1. Costs linked to activities'!J:J)","v":0},{"$f":"SUMIF('2. Communication Costs'!E:E,B80,'2. Communication Costs'!J:J)","v":0},{"$f":"SUMIF('3. Travel & Subsistence costs'!F:F,C80,'3. Travel & Subsistence costs'!M:M)+SUMIF('3. Travel & Subsistence costs'!F:F,C80,'3. Travel & Subsistence costs'!Q:Q)","v":0},{"$f":"SUMIF('4. Personnel  costs'!E:E,B80,'4. Personnel  costs'!W:W)","v":0},{"$f":"SUMIF('5. Indirect Costs'!B:B,B80,'5. Indirect Costs'!G:G)","v":0},0,null,{"$f":"SUMIFS('Co-financing  Income'!I:I,'Co-financing  Income'!B:B,Overview!B80,'Co-financing  Income'!E:E,'Data sources'!$L$4)","v":0},null,{"$f":"IF(OR(COUNTIF('Data sources'!$I$11:$I$193,Overview!D80)=0,Overview!C80=\"\"),\"Error\",\"\")","v":"Error"}]
[null,"P50",null,null,{"$f":"SUMIF('1. Costs linked to activities'!E:E,B81,'1. Costs linked to activities'!J:J)","v":0},{"$f":"SUMIF('2. Communication Costs'!E:E,B81,'2. Communication Costs'!J:J)","v":0},{"$f":"SUMIF('3. Travel & Subsistence costs'!F:F,C81,'3. Travel & Subsistence costs'!M:M)+SUMIF('3. Travel & Subsistence costs'!F:F,C81,'3. Travel & Subsistence costs'!Q:Q)","v":0},{"$f":"SUMIF('4. Personnel  costs'!E:E,B81,'4. Personnel  costs'!W:W)","v":0},{"$f":"SUMIF('5. Indirect Costs'!B:B,B81,'5. Indirect Costs'!G:G)","v":0},0,null,{"$f":"SUMIFS('Co-financing  Income'!I:I,'Co-financing  Income'!B:B,Overview!B81,'Co-financing  Income'!E:E,'Data sources'!$L$4)","v":0},null,{"$f":"IF(OR(COUNTIF('Data sources'!$I$11:$I$193,Overview!D81)=0,Overview!C81=\"\"),\"Error\",\"\")","v":"Error"}]
[null,"P51",null,null,{"$f":"SUMIF('1. Costs linked to activities'!E:E,B82,'1. Costs linked to activities'!J:J)","v":0},{"$f":"SUMIF('2. Communication Costs'!E:E,B82,'2. Communication Costs'!J:J)","v":0},{"$f":"SUMIF('3. Travel & Subsistence costs'!F:F,C82,'3. Travel & Subsistence costs'!M:M)+SUMIF('3. Travel & Subsistence costs'!F:F,C82,'3. Travel & Subsistence costs'!Q:Q)","v":0},{"$f":"SUMIF('4. Personnel  costs'!E:E,B82,'4. Personnel  costs'!W:W)","v":0},{"$f":"SUMIF('5. Indirect Costs'!B:B,B82,'5. Indirect Costs'!G:G)","v":0},0,null,{"$f":"SUMIFS('Co-financing  Income'!I:I,'Co-financing  Income'!B:B,Overview!B82,'Co-financing  Income'!E:E,'Data sources'!$L$4)","v":0},null,{"$f":"IF(OR(COUNTIF('Data sources'!$I$11:$I$193,Overview!D82)=0,Overview!C82=\"\"),\"Error\",\"\")","v":"Error"}]
[null,"P52",null,null,{"$f":"SUMIF('1. Costs linked to activities'!E:E,B83,'1. Costs linked to activities'!J:J)","v":0},{"$f":"SUMIF('2. Communication Costs'!E:E,B83,'2. Communication Costs'!J:J)","v":0},{"$f":"SUMIF('3. Travel & Subsistence costs'!F:F,C83,'3. Travel & Subsistence costs'!M:M)+SUMIF('3. Travel & Subsistence costs'!F:F,C83,'3. Travel & Subsistence costs'!Q:Q)","v":0},{"$f":"SUMIF('4. Personnel  costs'!E:E,B83,'4. Personnel  costs'!W:W)","v":0},{"$f":"SUMIF('5. Indirect Costs'!B:B,B83,'5. Indirect Costs'!G:G)","v":0},0,null,{"$f":"SUMIFS('Co-financing  Income'!I:I,'Co-financing  Income'!B:B,Overview!B83,'Co-financing  Income'!E:E,'Data sources'!$L$4)","v":0},null,{"$f":"IF(OR(COUNTIF('Data sources'!$I$11:$I$193,Overview!D83)=0,Overview!C83=\"\"),\"Error\",\"\")","v":"Error"}]
[null,"P53",null,null,{"$f":"SUMIF('1. Costs linked to activities'!E:E,B84,'1. Costs linked to activities'!J:J)","v":0},{"$f":"SUMIF('2. Communication Costs'!E:E,B84,'2. Communication Costs'!J:J)","v":0},{"$f":"SUMIF('3. Travel & Subsistence costs'!F:F,C84,'3. Travel & Subsistence costs'!M:M)+SUMIF('3. Travel & Subsistence costs'!F:F,C84,'3. Travel & Subsistence costs'!Q:Q)","v":0},{"$f":"SUMIF('4. Personnel  costs'!E:E,B84,'4. Personnel  costs'!W:W)","v":0},{"$f":"SUMIF('5. Indirect Costs'!B:B,B84,'5. Indirect Costs'!G:G)","v":0},0,null,{"$f":"SUMIFS('Co-financing  Income'!I:I,'Co-financing  Income'!B:B,Overview!B84,'Co-financing  Income'!E:E,'Data sources'!$L$4)","v":0},null,{"$f":"IF(OR(COUNTIF('Data sources'!$I$11:$I$193,Overview!D84)=0,Overview!C84=\"\"),\"Error\",\"\")","v":"Error"}]
[null,"P54",null,null,{"$f":"SUMIF('1. Costs linked to activities'!E:E,B85,'1. Costs linked to activities'!J:J)","v":0},{"$f":"SUMIF('2. Communication Costs'!E:E,B85,'2. Communication Costs'!J:J)","v":0},{"$f":"SUMIF('3. Travel & Subsistence costs'!F:F,C85,'3. Travel & Subsistence costs'!M:M)+SUMIF('3. Travel & Subsistence costs'!F:F,C85,'3. Travel & Subsistence costs'!Q:Q)","v":0},{"$f":"SUMIF('4. Personnel  costs'!E:E,B85,'4. Personnel  costs'!W:W)","v":0},{"$f":"SUMIF('5. Indirect Costs'!B:B,B85,'5. Indirect Costs'!G:G)","v":0},0,null,{"$f":"SUMIFS('Co-financing  Income'!I:I,'Co-financing  Income'!B:B,Overview!B85,'Co-financing  Income'!E:E,'Data sources'!$L$4)","v":0},null,{"$f":"IF(OR(COUNTIF('Data sources'!$I$11:$I$193,Overview!D85)=0,Overview!C85=\"\"),\"Error\",\"\")","v":"Error"}]
[null,"P55",null,null,{"$f":"SUMIF('1. Costs linked to activities'!E:E,B86,'1. Costs linked to activities'!J:J)","v":0},{"$f":"SUMIF('2. Communication Costs'!E:E,B86,'2. Communication Costs'!J:J)","v":0},{"$f":"SUMIF('3. Travel & Subsistence costs'!F:F,C86,'3. Travel & Subsistence costs'!M:M)+SUMIF('3. Travel & Subsistence costs'!F:F,C86,'3. Travel & Subsistence costs'!Q:Q)","v":0},{"$f":"SUMIF('4. Personnel  costs'!E:E,B86,'4. Personnel  costs'!W:W)","v":0},{"$f":"SUMIF('5. Indirect Costs'!B:B,B86,'5. Indirect Costs'!G:G)","v":0},0,null,{"$f":"SUMIFS('Co-financing  Income'!I:I,'Co-financing  Income'!B:B,Overview!B86,'Co-financing  Income'!E:E,'Data sources'!$L$4)","v":0},null,{"$f":"IF(OR(COUNTIF('Data sources'!$I$11:$I$193,Overview!D86)=0,Overview!C86=\"\"),\"Error\",\"\")","v":"Error"}]

{"sheet":"Action  Plan","index":1,"n_rows":219,"n_cols":13,"rows_kept":219,"cut":false,"hidden":false,"merged":[[16,3,17,3],[11,1,11,2],[13,1,13,2],[14,1,14,2],[16,8,16,9],[12,1,12,2],[16,12,17,12],[7,1,7,10],[8,1,8,10],[9,1,9,10],[13,3,13,10],[14,3,14,10],[16,10,17,10],[16,1,17,1],[16,2,17,2],[16,4,17,4],[16,5,17,5],[16,6,17,6],[16,7,17,7]]}
[]
[]
[]
[]
[null,null,null,null,"CREATIVE EUROPE - CULTURE"]
[]
[]
[null,"Before completing this table please read carefully the Guidelines and Guide for applicants available here: \nhttps://eacea.ec.europa.eu/creative-europe/funding/support-european-cooperation-projects-2019_en"]
[null,"CALL FOR PROPOSALS – EACEA 34/2018 - 'Support for European Cooperation Projects 2019'"]
[]
[]
[null,"Action type",null,{"$f":"IF(Overview!D11=\"\",\"(to encode in overview sheet)\",Overview!D11)","v":"(to encode in overview sheet)"}]
[null,"Duration / Eligibility period",null,{"$f":"IF(Overview!D12=\"\",\"\",Overview!D12)","v":""},"to",{"$f":"IF(Overview!F12=\"\",\"\",Overview!F12)","v":""},{"$f":"IF(OR(D13=\"dd/mm/yyyy\",F13=\"dd/mm/yyyy\"),\"Please encode the eligibility period of the project in the Overview Sheet  (dd/mm/yyyy)\",\"\")","v":""}]
[null,"Project Acronym",null,{"$f":"IF(Overview!D13=\"\",\"(to encode in overview sheet)\",Overview!D13)","v":"(to encode in overview sheet)"}]
[null,"Project Title",null,{"$f":"IF(Overview!D14=\"\",\"(to encode in overview sheet)\",Overview!D14)","v":"(to encode in overview sheet)"}]
[]
[null,"Activity N°","Activity name","Work Package","From\ndd/mm/yyyy","To\ndd/mm/yyyy","Country","Venue","Name of the  responsible partner ",null,"Sub-contracted? \nYes or No",null,"Check\nData\nEncoding"]
[null,null,null,null,null,null,null,null,"Partner N°","Name of Partner\n(to encode in overview sheet only)"]
[null,"A0",null,null,null,null,null,null,null,{"$f":"IFERROR(IF(VLOOKUP(I19,PartnerN°Ref,2,FALSE)=0,\"\",VLOOKUP(I19,PartnerN°Ref,2,FALSE)),\"\")","v":""},null,null,{"$f":"IF(OR(COUNTIF('Data sources'!$I$4:$I$8,D19)=0,COUNTIF('Data sources'!$I$11:$I$193,G19)=0,COUNTIF(PartnerN°,I19)=0,C19=\"\",E19=\"\",F19=\"\",K19=0),\"Error\",\"\")","v":"Error"}]
[null,"A1",null,null,null,null,null,null,null,"",null,null,{"$f":"IF(OR(COUNTIF('Data sources'!$I$4:$I$8,D20)=0,COUNTIF('Data sources'!$I$11:$I$193,G20)=0,COUNTIF(PartnerN°,I20)=0,C20=\"\",E20=\"\",F20=\"\",K20=0),\"Error\",\"\")","v":"Error"}]
[null,"A2",null,null,null,null,null,null,null,"",null,null,{"$f":"IF(OR(COUNTIF('Data sources'!$I$4:$I$8,D21)=0,COUNTIF('Data sources'!$I$11:$I$193,G21)=0,COUNTIF(PartnerN°,I21)=0,C21=\"\",E21=\"\",F21=\"\",K21=0),\"Error\",\"\")","v":"Error"}]
[null,"A3",null,null,null,null,null,null,null,"",null,null,{"$f":"IF(OR(COUNTIF('Data sources'!$I$4:$I$8,D22)=0,COUNTIF('Data sources'!$I$11:$I$193,G22)=0,COUNTIF(PartnerN°,I22)=0,C22=\"\",E22=\"\",F22=\"\",K22=0),\"Error\",\"\")","v":"Error"}]
[null,"A4",null,null,null,null,null,null,null,"",null,null,{"$f":"IF(OR(COUNTIF('Data sources'!$I$4:$I$8,D23)=0,COUNTIF('Data sources'!$I$11:$I$193,G23)=0,COUNTIF(PartnerN°,I23)=0,C23=\"\",E23=\"\",F23=\"\",K23=0),\"Error\",\"\")","v":"Error"}]
[null,"A5",null,null,null,null,null,null,null,"",null,null,{"$f":"IF(OR(COUNTIF('Data sources'!$I$4:$I$8,D24)=0,COUNTIF('Data sources'!$I$11:$I$193,G24)=0,COUNTIF(PartnerN°,I24)=0,C24=\"\",E24=\"\",F24=\"\",K24=0),\"Error\",\"\")","v":"Error"}]
[null,"A6",null,null,null,null,null,null,null,"",null,null,{"$f":"IF(OR(COUNTIF('Data sources'!$I$4:$I$8,D25)=0,COUNTIF('Data sources'!$I$11:$I$193,G25)=0,COUNTIF(PartnerN°,I25)=0,C25=\"\",E25=\"\",F25=\"\",K25=0),\"Error\",\"\")","v":"Error"}]
[null,"A7",null,null,null,null,null,null,null,"",null,null,{"$f":"IF(OR(COUNTIF('Data sources'!$I$4:$I$8,D26)=0,COUNTIF('Data sources'!$I$11:$I$193,G26)=0,COUNTIF(PartnerN°,I26)=0,C26=\"\",E26=\"\",F26=\"\",K26=0),\"Error\",\"\")","v":"Error"}]
[null,"A8",null,null,null,null,null,null,null,"",null,null,{"$f":"IF(OR(COUNTIF('Data sources'!$I$4:$I$8,D27)=0,COUNTIF('Data sources'!$I$11:$I$193,G27)=0,COUNTIF(PartnerN°,I27)=0,C27=\"\",E27=\"\",F27=\"\",K27=0),\"Error\",\"\")","v":"Error"}]
[null,"A9",null,null,null,null,null,null,null,"",null,null,{"$f":"IF(OR(COUNTIF('Data sources'!$I$4:$I$8,D28)=0,COUNTIF('Data sources'!$I$11:$I$193,G28)=0,COUNTIF(PartnerN°,I28)=0,C28=\"\",E28=\"\",F28=\"\",K28=0),\"Error\",\"\")","v":"Error"}]
[null,"A10",null,null,null,null,null,null,null,"",null,null,{"$f":"IF(OR(COUNTIF('Data sources'!$I$4:$I$8,D29)=0,COUNTIF('Data sources'!$I$11:$I$193,G29)=0,COUNTIF(PartnerN°,I29)=0,C29=\"\",E29=\"\",F29=\"\",K29=0),\"Error\",\"\")","v":"Error"}]
[null,"A11",null,null,null,null,null,null,null,"",null,null,{"$f":"IF(OR(COUNTIF('Data sources'!$I$4:$I$8,D30)=0,COUNTIF('Data sources'!$I$11:$I$193,G30)=0,COUNTIF(PartnerN°,I30)=0,C30=\"\",E30=\"\",F30=\"\",K30=0),\"Error\",\"\")","v":"Error"}]
[null,"A12",null,null,null,null,null,null,null,"",null,null,{"$f":"IF(OR(COUNTIF('Data sources'!$I$4:$I$8,D31)=0,COUNTIF('Data sources'!$I$11:$I$193,G31)=0,COUNTIF(PartnerN°,I31)=0,C31=\"\",E31=\"\",F31=\"\",K31=0),\"Error\",\"\")","v":"Error"}]
[null,"A13",null,null,null,null,null,null,null,"",null,null,{"$f":"IF(OR(COUNTIF('Data sources'!$I$4:$I$8,D32)=0,COUNTIF('Data sources'!$I$11:$I$193,G32)=0,COUNTIF(PartnerN°,I32)=0,C32=\"\",E32=\"\",F32=\"\",K32=0),\"Error\",\"\")","v":"Error"}]
[null,"A14",null,null,null,null,null,null,null,"",null,null,{"$f":"IF(OR(COUNTIF('Data sources'!$I$4:$I$8,D33)=0,COUNTIF('Data sources'!$I$11:$I$193,G33)=0,COUNTIF(PartnerN°,I33)=0,C33=\"\",E33=\"\",F33=\"\",K33=0),\"Error\",\"\")","v":"Error"}]
[null,"A15",null,null,null,null,null,null,null,"",null,null,{"$f":"IF(OR(COUNTIF('Data sources'!$I$4:$I$8,D34)=0,COUNTIF('Data sources'!$I$11:$I$193,G34)=0,COUNTIF(PartnerN°,I34)=0,C34=\"\",E34=\"\",F34=\"\",K34=0),\"Error\",\"\")","v":"Error"}]
[null,"A16",null,null,null,null,null,null,null,"",null,null,{"$f":"IF(OR(COUNTIF('Data sources'!$I$4:$I$8,D35)=0,COUNTIF('Data sources'!$I$11:$I$193,G35)=0,COUNTIF(PartnerN°,I35)=0,C35=\"\",E35=\"\",F35=\"\",K35=0),\"Error\",\"\")","v":"Error"}]
[null,"A17",null,null,null,null,null,null,null,"",null,null,{"$f":"IF(OR(COUNTIF('Data sources'!$I$4:$I$8,D36)=0,COUNTIF('Data sources'!$I$11:$I$193,G36)=0,COUNTIF(PartnerN°,I36)=0,C36=\"\",E36=\"\",F36=\"\",K36=0),\"Error\",\"\")","v":"Error"}]
[null,"A18",null,null,null,null,null,null,null,"",null,null,{"$f":"IF(OR(COUNTIF('Data sources'!$I$4:$I$8,D37)=0,COUNTIF('Data sources'!$I$11:$I$193,G37)=0,COUNTIF(PartnerN°,I37)=0,C37=\"\",E37=\"\",F37=\"\",K37=0),\"Error\",\"\")","v":"Error"}]
[null,"A19",null,null,null,null,null,null,null,"",null,null,{"$f":"IF(OR(COUNTIF('Data sources'!$I$4:$I$8,D38)=0,COUNTIF('Data sources'!$I$11:$I$193,G38)=0,COUNTIF(PartnerN°,I38)=0,C38=\"\",E38=\"\",F38=\"\",K38=0),\"Error\",\"\")","v":"Error"}]
[null,"A20",null,null,null,null,null,null,null,"",null,null,{"$f":"IF(OR(COUNTIF('Data sources'!$I$4:$I$8,D39)=0,COUNTIF('Data sources'!$I$11:$I$193,G39)=0,COUNTIF(PartnerN°,I39)=0,C39=\"\",E39=\"\",F39=\"\",K39=0),\"Error\",\"\")","v":"Error"}]
[null,"A21",null,null,null,null,null,null,null,"",null,null,{"$f":"IF(OR(COUNTIF('Data sources'!$I$4:$I$8,D40)=0,COUNTIF('Data sources'!$I$11:$I$193,G40)=0,COUNTIF(PartnerN°,I40)=0,C40=\"\",E40=\"\",F40=\"\",K40=0),\"Error\",\"\")","v":"Error"}]
[null,"A22",null,null,null,null,null,null,null,"",null,null,{"$f":"IF(OR(COUNTIF('Data sources'!$I$4:$I$8,D41)=0,COUNTIF('Data sources'!$I$11:$I$193,G41)=0,COUNTIF(PartnerN°,I41)=0,C41=\"\",E41=\"\",F41=\"\",K41=0),\"Error\",\"\")","v":"Error"}]
[null,"A23",null,null,null,null,null,null,null,"",null,null,{"$f":"IF(OR(COUNTIF('Data sources'!$I$4:$I$8,D42)=0,COUNTIF('Data sources'!$I$11:$I$193,G42)=0,COUNTIF(PartnerN°,I42)=0,C42=\"\",E42=\"\",F42=\"\",K42=0),\"Error\",\"\")","v":"Error"}]
[null,"A24",null,null,null,null,null,null,null,"",null,null,{"$f":"IF(OR(COUNTIF('Data sources'!$I$4:$I$8,D43)=0,COUNTIF('Data sources'!$I$11:$I$193,G43)=0,COUNTIF(PartnerN°,I43)=0,C43=\"\",E43=\"\",F43=\"\",K43=0),\"Error\",\"\")","v":"Error"}]
[null,"A25",null,null,null,null,null,null,null,"",null,null,{"$f":"IF(OR(COUNTIF('Data sources'!$I$4:$I$8,D44)=0,COUNTIF('Data sources'!$I$11:$I$193,G44)=0,COUNTIF(PartnerN°,I44)=0,C44=\"\",E44=\"\",F44=\"\",K44=0),\"Error\",\"\")","v":"Error"}]
[null,"A26",null,null,null,null,null,null,null,"",null,null,{"$f":"IF(OR(COUNTIF('Data sources'!$I$4:$I$8,D45)=0,COUNTIF('Data sources'!$I$11:$I$193,G45)=0,COUNTIF(PartnerN°,I45)=0,C45=\"\",E45=\"\",F45=\"\",K45=0),\"Error\",\"\")","v":"Error"}]
[null,"A27",null,null,null,null,null,null,null,"",null,null,{"$f":"IF(OR(COUNTIF('Data sources'!$I$4:$I$8,D46)=0,COUNTIF('Data sources'!$I$11:$I$193,G46)=0,COUNTIF(PartnerN°,I46)=0,C46=\"\",E46=\"\",F46=\"\",K46=0),\"Error\",\"\")","v":"Error"}]
[null,"A28",null,null,null,null,null,null,null,"",null,null,{"$f":"IF(OR(COUNTIF('Data sources'!$I$4:$I$8,D47)=0,COUNTIF('Data sources'!$I$11:$I$193,G47)=0,COUNTIF(PartnerN°,I47)=0,C47=\"\",E47=\"\",F47=\"\",K47=0),\"Error\",\"\")","v":"Error"}]
[null,"A29",null,null,null,null,null,null,null,"",null,null,{"$f":"IF(OR(COUNTIF('Data sources'!$I$4:$I$8,D48)=0,COUNTIF('Data sources'!$I$11:$I$193,G48)=0,COUNTIF(PartnerN°,I48)=0,C48=\"\",E48=\"\",F48=\"\",K48=0),\"Error\",\"\")","v":"Error"}]
[null,"A30",null,null,null,null,null,null,null,"",null,null,{"$f":"IF(OR(COUNTIF('Data sources'!$I$4:$I$8,D49)=0,COUNTIF('Data sources'!$I$11:$I$193,G49)=0,COUNTIF(PartnerN°,I49)=0,C49=\"\",E49=\"\",F49=\"\",K49=0),\"Error\",\"\")","v":"Error"}]
[null,"A31",null,null,null,null,null,null,null,"",null,null,{"$f":"IF(OR(COUNTIF('Data sources'!$I$4:$I$8,D50)=0,COUNTIF('Data sources'!$I$11:$I$193,G50)=0,COUNTIF(PartnerN°,I50)=0,C50=\"\",E50=\"\",F50=\"\",K50=0),\"Error\",\"\")","v":"Error"}]
[null,"A32",null,null,null,null,null,null,null,"",null,null,{"$f":"IF(OR(COUNTIF('Data sources'!$I$4:$I$8,D51)=0,COUNTIF('Data sources'!$I$11:$I$193,G51)=0,COUNTIF(PartnerN°,I51)=0,C51=\"\",E51=\"\",F51=\"\",K51=0),\"Error\",\"\")","v":"Error"}]
[null,"A33",null,null,null,null,null,null,null,{"$f":"IFERROR(IF(VLOOKUP(I52,PartnerN°Ref,2,FALSE)=0,\"\",VLOOKUP(I52,PartnerN°Ref,2,FALSE)),\"\")","v":""},null,null,{"$f":"IF(OR(COUNTIF('Data sources'!$I$4:$I$8,D52)=0,COUNTIF('Data sources'!$I$11:$I$193,G52)=0,COUNTIF(PartnerN°,I52)=0,C52=\"\",E52=\"\",F52=\"\",K52=0),\"Error\",\"\")","v":"Error"}]
[null,"A34",null,null,null,null,null,null,null,"",null,null,{"$f":"IF(OR(COUNTIF('Data sources'!$I$4:$I$8,D53)=0,COUNTIF('Data sources'!$I$11:$I$193,G53)=0,COUNTIF(PartnerN°,I53)=0,C53=\"\",E53=\"\",F53=\"\",K53=0),\"Error\",\"\")","v":"Error"}]
[null,"A35",null,null,null,null,null,null,null,"",null,null,{"$f":"IF(OR(COUNTIF('Data sources'!$I$4:$I$8,D54)=0,COUNTIF('Data sources'!$I$11:$I$193,G54)=0,COUNTIF(PartnerN°,I54)=0,C54=\"\",E54=\"\",F54=\"\",K54=0),\"Error\",\"\")","v":"Error"}]
[null,"A36",null,null,null,null,null,null,null,"",null,null,{"$f":"IF(OR(COUNTIF('Data sources'!$I$4:$I$8,D55)=0,COUNTIF('Data sources'!$I$11:$I$193,G55)=0,COUNTIF(PartnerN°,I55)=0,C55=\"\",E55=\"\",F55=\"\",K55=0),\"Error\",\"\")","v":"Error"}]
[null,"A37",null,null,null,null,null,null,null,"",null,null,{"$f":"IF(OR(COUNTIF('Data sources'!$I$4:$I$8,D56)=0,COUNTIF('Data sources'!$I$11:$I$193,G56)=0,COUNTIF(PartnerN°,I56)=0,C56=\"\",E56=\"\",F56=\"\",K56=0),\"Error\",\"\")","v":"Error"}]
[null,"A38",null,null,null,null,null,null,null,"",null,null,{"$f":"IF(OR(COUNTIF('Data sources'!$I$4:$I$8,D57)=0,COUNTIF('Data sources'!$I$11:$I$193,G57)=0,COUNTIF(PartnerN°,I57)=0,C57=\"\",E57=\"\",F57=\"\",K57=0),\"Error\",\"\")","v":"Error"}]
[null,"A39",null,null,null,null,null,null,null,"",null,null,{"$f":"IF(OR(COUNTIF('Data sources'!$I$4:$I$8,D58)=0,COUNTIF('Data sources'!$I$11:$I$193,G58)=0,COUNTIF(PartnerN°,I58)=0,C58=\"\",E58=\"\",F58=\"\",K58=0),\"Error\",\"\")","v":"Error"}]
[null,"A40",null,null,null,null,null,null,null,"",null,null,{"$f":"IF(OR(COUNTIF('Data sources'!$I$4:$I$8,D59)=0,COUNTIF('Data sources'!$I$11:$I$193,G59)=0,COUNTIF(PartnerN°,I59)=0,C59=\"\",E59=\"\",F59=\"\",K59=0),\"Error\",\"\")","v":"Error"}]
[null,"A41",null,null,null,null,null,null,null,"",null,null,{"$f":"IF(OR(COUNTIF('Data sources'!$I$4:$I$8,D60)=0,COUNTIF('Data sources'!$I$11:$I$193,G60)=0,COUNTIF(PartnerN°,I60)=0,C60=\"\",E60=\"\",F60=\"\",K60=0),\"Error\",\"\")","v":"Error"}]
[null,"A42",null,null,null,null,null,null,null,"",null,null,{"$f":"IF(OR(COUNTIF('Data sources'!$I$4:$I$8,D61)=0,COUNTIF('Data sources'!$I$11:$I$193,G61)=0,COUNTIF(PartnerN°,I61)=0,C61=\"\",E61=\"\",F61=\"\",K61=0),\"Error\",\"\")","v":"Error"}]
[null,"A43",null,null,null,null,null,null,null,"",null,null,{"$f":"IF(OR(COUNTIF('Data sources'!$I$4:$I$8,D62)=0,COUNTIF('Data sources'!$I$11:$I$193,G62)=0,COUNTIF(PartnerN°,I62)=0,C62=\"\",E62=\"\",F62=\"\",K62=0),\"Error\",\"\")","v":"Error"}]
[null,"A44",null,null,null,null,null,null,null,"",null,null,{"$f":"IF(OR(COUNTIF('Data sources'!$I$4:$I$8,D63)=0,COUNTIF('Data sources'!$I$11:$I$193,G63)=0,COUNTIF(PartnerN°,I63)=0,C63=\"\",E63=\"\",F63=\"\",K63=0),\"Error\",\"\")","v":"Error"}]
[null,"A45",null,null,null,null,null,null,null,"",null,null,{"$f":"IF(OR(COUNTIF('Data sources'!$I$4:$I$8,D64)=0,COUNTIF('Data sources'!$I$11:$I$193,G64)=0,COUNTIF(PartnerN°,I64)=0,C64=\"\",E64=\"\",F64=\"\",K64=0),\"Error\",\"\")","v":"Error"}]
[null,"A46",null,null,null,null,null,null,null,"",null,null,{"$f":"IF(OR(COUNTIF('Data sources'!$I$4:$I$8,D65)=0,COUNTIF('Data sources'!$I$11:$I$193,G65)=0,COUNTIF(PartnerN°,I65)=0,C65=\"\",E65=\"\",F65=\"\",K65=0),\"Error\",\"\")","v":"Error"}]
[null,"A47",null,null,null,null,null,null,null,"",null,null,{"$f":"IF(OR(COUNTIF('Data sources'!$I$4:$I$8,D66)=0,COUNTIF('Data sources'!$I$11:$I$193,G66)=0,COUNTIF(PartnerN°,I66)=0,C66=\"\",E66=\"\",F66=\"\",K66=0),\"Error\",\"\")","v":"Error"}]
[null,"A48",null,null,null,null,null,null,null,"",null,null,{"$f":"IF(OR(COUNTIF('Data sources'!$I$4:$I$8,D67)=0,COUNTIF('Data sources'!$I$11:$I$193,G67)=0,COUNTIF(PartnerN°,I67)=0,C67=\"\",E67=\"\",F67=\"\",K67=0),\"Error\",\"\")","v":"Error"}]
[null,"A49",null,null,null,null,null,null,null,"",null,null,{"$f":"IF(OR(COUNTIF('Data sources'!$I$4:$I$8,D68)=0,COUNTIF('Data sources'!$I$11:$I$193,G68)=0,COUNTIF(PartnerN°,I68)=0,C68=\"\",E68=\"\",F68=\"\",K68=0),\"Error\",\"\")","v":"Error"}]
[null,"A50",null,null,null,null,null,null,null,"",null,null,{"$f":"IF(OR(COUNTIF('Data sources'!$I$4:$I$8,D69)=0,COUNTIF('Data sources'!$I$11:$I$193,G69)=0,COUNTIF(PartnerN°,I69)=0,C69=\"\",E69=\"\",F69=\"\",K69=0),\"Error\",\"\")","v":"Error"}]
[null,"A51",null,null,null,null,null,null,null,"",null,null,{"$f":"IF(OR(COUNTIF('Data sources'!$I$4:$I$8,D70)=0,COUNTIF('Data sources'!$I$11:$I$193,G70)=0,COUNTIF(PartnerN°,I70)=0,C70=\"\",E70=\"\",F70=\"\",K70=0),\"Error\",\"\")","v":"Error"}]
[null,"A52",null,null,null,null,null,null,null,"",null,null,{"$f":"IF(OR(COUNTIF('Data sources'!$I$4:$I$8,D71)=0,COUNTIF('Data sources'!$I$11:$I$193,G71)=0,COUNTIF(PartnerN°,I71)=0,C71=\"\",E71=\"\",F71=\"\",K71=0),\"Error\",\"\")","v":"Error"}]
[null,"A53",null,null,null,null,null,null,null,"",null,null,{"$f":"IF(OR(COUNTIF('Data sources'!$I$4:$I$8,D72)=0,COUNTIF('Data sources'!$I$11:$I$193,G72)=0,COUNTIF(PartnerN°,I72)=0,C72=\"\",E72=\"\",F72=\"\",K72=0),\"Error\",\"\")","v":"Error"}]
[null,"A54",null,null,null,null,null,null,null,"",null,null,{"$f":"IF(OR(COUNTIF('Data sources'!$I$4:$I$8,D73)=0,COUNTIF('Data sources'!$I$11:$I$193,G73)=0,COUNTIF(PartnerN°,I73)=0,C73=\"\",E73=\"\",F73=\"\",K73=0),\"Error\",\"\")","v":"Error"}]
[null,"A55",null,null,null,null,null,null,null,"",null,null,{"$f":"IF(OR(COUNTIF('Data sources'!$I$4:$I$8,D74)=0,COUNTIF('Data sources'!$I$11:$I$193,G74)=0,COUNTIF(PartnerN°,I74)=0,C74=\"\",E74=\"\",F74=\"\",K74=0),\"Error\",\"\")","v":"Error"}]
[null,"A56",null,null,null,null,null,null,null,"",null,null,{"$f":"IF(OR(COUNTIF('Data sources'!$I$4:$I$8,D75)=0,COUNTIF('Data sources'!$I$11:$I$193,G75)=0,COUNTIF(PartnerN°,I75)=0,C75=\"\",E75=\"\",F75=\"\",K75=0),\"Error\",\"\")","v":"Error"}]
[null,"A57",null,null,null,null,null,null,null,"",null,null,{"$f":"IF(OR(COUNTIF('Data sources'!$I$4:$I$8,D76)=0,COUNTIF('Data sources'!$I$11:$I$193,G76)=0,COUNTIF(PartnerN°,I76)=0,C76=\"\",E76=\"\",F76=\"\",K76=0),\"Error\",\"\")","v":"Error"}]
[null,"A58",null,null,null,null,null,null,null,"",null,null,{"$f":"IF(OR(COUNTIF('Data sources'!$I$4:$I$8,D77)=0,COUNTIF('Data sources'!$I$11:$I$193,G77)=0,COUNTIF(PartnerN°,I77)=0,C77=\"\",E77=\"\",F77=\"\",K77=0),\"Error\",\"\")","v":"Error"}]
[null,"A59",null,null,null,null,null,null,null,"",null,null,{"$f":"IF(OR(COUNTIF('Data sources'!$I$4:$I$8,D78)=0,COUNTIF('Data sources'!$I$11:$I$193,G78)=0,COUNTIF(PartnerN°,I78)=0,C78=\"\",E78=\"\",F78=\"\",K78=0),\"Error\",\"\")","v":"Error"}]
[null,"A60",null,null,null,null,null,null,null,"",null,null,{"$f":"IF(OR(COUNTIF('Data sources'!$I$4:$I$8,D79)=0,COUNTIF('Data sources'!$I$11:$I$193,G79)=0,COUNTIF(PartnerN°,I79)=0,C79=\"\",E79=\"\",F79=\"\",K79=0),\"Error\",\"\")","v":"Error"}]
[null,"A61",null,null,null,null,null,null,null,"",null,null,{"$f":"IF(OR(COUNTIF('Data sources'!$I$4:$I$8,D80)=0,COUNTIF('Data sources'!$I$11:$I$193,G80)=0,COUNTIF(PartnerN°,I80)=0,C80=\"\",E80=\"\",F80=\"\",K80=0),\"Error\",\"\")","v":"Error"}]
[null,"A62",null,null,null,null,null,null,null,"",null,null,{"$f":"IF(OR(COUNTIF('Data sources'!$I$4:$I$8,D81)=0,COUNTIF('Data sources'!$I$11:$I$193,G81)=0,COUNTIF(PartnerN°,I81)=0,C81=\"\",E81=\"\",F81=\"\",K81=0),\"Error\",\"\")","v":"Error"}]
[null,"A63",null,null,null,null,null,null,null,"",null,null,{"$f":"IF(OR(COUNTIF('Data sources'!$I$4:$I$8,D82)=0,COUNTIF('Data sources'!$I$11:$I$193,G82)=0,COUNTIF(PartnerN°,I82)=0,C82=\"\",E82=\"\",F82=\"\",K82=0),\"Error\",\"\")","v":"Error"}]
[null,"A64",null,null,null,null,null,null,null,"",null,null,{"$f":"IF(OR(COUNTIF('Data sources'!$I$4:$I$8,D83)=0,COUNTIF('Data sources'!$I$11:$I$193,G83)=0,COUNTIF(PartnerN°,I83)=0,C83=\"\",E83=\"\",F83=\"\",K83=0),\"Error\",\"\")","v":"Error"}]
[null,"A65",null,null,null,null,null,null,null,{"$f":"IFERROR(IF(VLOOKUP(I84,PartnerN°Ref,2,FALSE)=0,\"\",VLOOKUP(I84,PartnerN°Ref,2,FALSE)),\"\")","v":""},null,null,{"$f":"IF(OR(COUNTIF('Data sources'!$I$4:$I$8,D84)=0,COUNTIF('Data sources'!$I$11:$I$193,G84)=0,COUNTIF(PartnerN°,I84)=0,C84=\"\",E84=\"\",F84=\"\",K84=0),\"Error\",\"\")","v":"Error"}]
[null,"A66",null,null,null,null,null,null,null,"",null,null,{"$f":"IF(OR(COUNTIF('Data sources'!$I$4:$I$8,D85)=0,COUNTIF('Data sources'!$I$11:$I$193,G85)=0,COUNTIF(PartnerN°,I85)=0,C85=\"\",E85=\"\",F85=\"\",K85=0),\"Error\",\"\")","v":"Error"}]
[null,"A67",null,null,null,null,null,null,null,"",null,null,{"$f":"IF(OR(COUNTIF('Data sources'!$I$4:$I$8,D86)=0,COUNTIF('Data sources'!$I$11:$I$193,G86)=0,COUNTIF(PartnerN°,I86)=0,C86=\"\",E86=\"\",F86=\"\",K86=0),\"Error\",\"\")","v":"Error"}]
[null,"A68",null,null,null,null,null,null,null,"",null,null,{"$f":"IF(OR(COUNTIF('Data sources'!$I$4:$I$8,D87)=0,COUNTIF('Data sources'!$I$11:$I$193,G87)=0,COUNTIF(PartnerN°,I87)=0,C87=\"\",E87=\"\",F87=\"\",K87=0),\"Error\",\"\")","v":"Error"}]
[null,"A69",null,null,null,null,null,null,null,"",null,null,{"$f":"IF(OR(COUNTIF('Data sources'!$I$4:$I$8,D88)=0,COUNTIF('Data sources'!$I$11:$I$193,G88)=0,COUNTIF(PartnerN°,I88)=0,C88=\"\",E88=\"\",F88=\"\",K88=0),\"Error\",\"\")","v":"Error"}]
[null,"A70",null,null,null,null,null,null,null,"",null,null,{"$f":"IF(OR(COUNTIF('Data sources'!$I$4:$I$8,D89)=0,COUNTIF('Data sources'!$I$11:$I$193,G89)=0,COUNTIF(PartnerN°,I89)=0,C89=\"\",E89=\"\",F89=\"\",K89=0),\"Error\",\"\")","v":"Error"}]
[null,"A71",null,null,null,null,null,null,null,"",null,null,{"$f":"IF(OR(COUNTIF('Data sources'!$I$4:$I$8,D90)=0,COUNTIF('Data sources'!$I$11:$I$193,G90)=0,COUNTIF(PartnerN°,I90)=0,C90=\"\",E90=\"\",F90=\"\",K90=0),\"Error\",\"\")","v":"Error"}]
[null,"A72",null,null,null,null,null,null,null,"",null,null,{"$f":"IF(OR(COUNTIF('Data sources'!$I$4:$I$8,D91)=0,COUNTIF('Data sources'!$I$11:$I$193,G91)=0,COUNTIF(PartnerN°,I91)=0,C91=\"\",E91=\"\",F91=\"\",K91=0),\"Error\",\"\")","v":"Error"}]
[null,"A73",null,null,null,null,null,null,null,"",null,null,{"$f":"IF(OR(COUNTIF('Data sources'!$I$4:$I$8,D92)=0,COUNTIF('Data sources'!$I$11:$I$193,G92)=0,COUNTIF(PartnerN°,I92)=0,C92=\"\",E92=\"\",F92=\"\",K92=0),\"Error\",\"\")","v":"Error"}]
[null,"A74",null,null,null,null,null,null,null,"",null,null,{"$f":"IF(OR(COUNTIF('Data sources'!$I$4:$I$8,D93)=0,COUNTIF('Data sources'!$I$11:$I$193,G93)=0,COUNTIF(PartnerN°,I93)=0,C93=\"\",E93=\"\",F93=\"\",K93=0),\"Error\",\"\")","v":"Error"}]
[null,"A75",null,null,null,null,null,null,null,"",null,null,{"$f":"IF(OR(COUNTIF('Data sources'!$I$4:$I$8,D94)=0,COUNTIF('Data sources'!$I$11:$I$193,G94)=0,COUNTIF(PartnerN°,I94)=0,C94=\"\",E94=\"\",F94=\"\",K94=0),\"Error\",\"\")","v":"Error"}]
[null,"A76",null,null,null,null,null,null,null,"",null,null,{"$f":"IF(OR(COUNTIF('Data sources'!$I$4:$I$8,D95)=0,COUNTIF('Data sources'!$I$11:$I$193,G95)=0,COUNTIF(PartnerN°,I95)=0,C95=\"\",E95=\"\",F95=\"\",K95=0),\"Error\",\"\")","v":"Error"}]
[null,"A77",null,null,null,null,null,null,null,"",null,null,{"$f":"IF(OR(COUNTIF('Data sources'!$I$4:$I$8,D96)=0,COUNTIF('Data sources'!$I$11:$I$193,G96)=0,COUNTIF(PartnerN°,I96)=0,C96=\"\",E96=\"\",F96=\"\",K96=0),\"Error\",\"\")","v":"Error"}]
[null,"A78",null,null,null,null,null,null,null,"",null,null,{"$f":"IF(OR(COUNTIF('Data sources'!$I$4:$I$8,D97)=0,COUNTIF('Data sources'!$I$11:$I$193,G97)=0,COUNTIF(PartnerN°,I97)=0,C97=\"\",E97=\"\",F97=\"\",K97=0),\"Error\",\"\")","v":"Error"}]
[null,"A79",null,null,null,null,null,null,null,"",null,null,{"$f":"IF(OR(COUNTIF('Data sources'!$I$4:$I$8,D98)=0,COUNTIF('Data sources'!$I$11:$I$193,G98)=0,COUNTIF(PartnerN°,I98)=0,C98=\"\",E98=\"\",F98=\"\",K98=0),\"Error\",\"\")","v":"Error"}]
[null,"A80",null,null,null,null,null,null,null,"",null,null,{"$f":"IF(OR(COUNTIF('Data sources'!$I$4:$I$8,D99)=0,COUNTIF('Data sources'!$I$11:$I$193,G99)=0,COUNTIF(PartnerN°,I99)=0,C99=\"\",E99=\"\",F99=\"\",K99=0),\"Error\",\"\")","v":"Error"}]
[null,"A81",null,null,null,null,null,null,null,"",null,null,{"$f":"IF(OR(COUNTIF('Data sources'!$I$4:$I$8,D100)=0,COUNTIF('Data sources'!$I$11:$I$193,G100)=0,COUNTIF(PartnerN°,I100)=0,C100=\"\",E100=\"\",F100=\"\",K100=0),\"Error\",\"\")","v":"Error"}]
[null,"A82",null,null,null,null,null,null,null,"",null,null,{"$f":"IF(OR(COUNTIF('Data sources'!$I$4:$I$8,D101)=0,COUNTIF('Data sources'!$I$11:$I$193,G101)=0,COUNTIF(PartnerN°,I101)=0,C101=\"\",E101=\"\",F101=\"\",K101=0),\"Error\",\"\")","v":"Error"}]
[null,"A83",null,null,null,null,null,null,null,"",null,null,{"$f":"IF(OR(COUNTIF('Data sources'!$I$4:$I$8,D102)=0,COUNTIF('Data sources'!$I$11:$I$193,G102)=0,COUNTIF(PartnerN°,I102)=0,C102=\"\",E102=\"\",F102=\"\",K102=0),\"Error\",\"\")","v":"Error"}]
[null,"A84",null,null,null,null,null,null,null,"",null,null,{"$f":"IF(OR(COUNTIF('Data sources'!$I$4:$I$8,D103)=0,COUNTIF('Data sources'!$I$11:$I$193,G103)=0,COUNTIF(PartnerN°,I103)=0,C103=\"\",E103=\"\",F103=\"\",K103=0),\"Error\",\"\")","v":"Error"}]
[null,"A85",null,null,null,null,null,null,null,"",null,null,{"$f":"IF(OR(COUNTIF('Data sources'!$I$4:$I$8,D104)=0,COUNTIF('Data sources'!$I$11:$I$193,G104)=0,COUNTIF(PartnerN°,I104)=0,C104=\"\",E104=\"\",F104=\"\",K104=0),\"Error\",\"\")","v":"Error"}]
[null,"A86",null,null,null,null,null,null,null,"",null,null,{"$f":"IF(OR(COUNTIF('Data sources'!$I$4:$I$8,D105)=0,COUNTIF('Data sources'!$I$11:$I$193,G105)=0,COUNTIF(PartnerN°,I105)=0,C105=\"\",E105=\"\",F105=\"\",K105=0),\"Error\",\"\")","v":"Error"}]
[null,"A87",null,null,null,null,null,null,null,"",null,null,{"$f":"IF(OR(COUNTIF('Data sources'!$I$4:$I$8,D106)=0,COUNTIF('Data sources'!$I$11:$I$193,G106)=0,COUNTIF(PartnerN°,I106)=0,C106=\"\",E106=\"\",F106=\"\",K106=0),\"Error\",\"\")","v":"Error"}]
[null,"A88",null,null,null,null,null,null,null,"",null,null,{"$f":"IF(OR(COUNTIF('Data sources'!$I$4:$I$8,D107)=0,COUNTIF('Data sources'!$I$11:$I$193,G107)=0,COUNTIF(PartnerN°,I107)=0,C107=\"\",E107=\"\",F107=\"\",K107=0),\"Error\",\"\")","v":"Error"}]
[null,"A89",null,null,null,null,null,null,null,"",null,null,{"$f":"IF(OR(COUNTIF('Data sources'!$I$4:$I$8,D108)=0,COUNTIF('Data sources'!$I$11:$I$193,G108)=0,COUNTIF(PartnerN°,I108)=0,C108=\"\",E108=\"\",F108=\"\",K108=0),\"Error\",\"\")","v":"Error"}]
[null,"A90",null,null,null,null,null,null,null,"",null,null,{"$f":"IF(OR(COUNTIF('Data sources'!$I$4:$I$8,D109)=0,COUNTIF('Data sources'!$I$11:$I$193,G109)=0,COUNTIF(PartnerN°,I109)=0,C109=\"\",E109=\"\",F109=\"\",K109=0),\"Error\",\"\")","v":"Error"}]
[null,"A91",null,null,null,null,null,null,null,"",null,null,{"$f":"IF(OR(COUNTIF('Data sources'!$I$4:$I$8,D110)=0,COUNTIF('Data sources'!$I$11:$I$193,G110)=0,COUNTIF(PartnerN°,I110)=0,C110=\"\",E110=\"\",F110=\"\",K110=0),\"Error\",\"\")","v":"Error"}]
[null,"A92",null,null,null,null,null,null,null,"",null,null,{"$f":"IF(OR(COUNTIF('Data sources'!$I$4:$I$8,D111)=0,COUNTIF('Data sources'!$I$11:$I$193,G111)=0,COUNTIF(PartnerN°,I111)=0,C111=\"\",E111=\"\",F111=\"\",K111=0),\"Error\",\"\")","v":"Error"}]
[null,"A93",null,null,null,null,null,null,null,"",null,null,{"$f":"IF(OR(COUNTIF('Data sources'!$I$4:$I$8,D112)=0,COUNTIF('Data sources'!$I$11:$I$193,G112)=0,COUNTIF(PartnerN°,I112)=0,C112=\"\",E112=\"\",F112=\"\",K112=0),\"Error\",\"\")","v":"Error"}]
[null,"A94",null,null,null,null,null,null,null,"",null,null,{"$f":"IF(OR(COUNTIF('Data sources'!$I$4:$I$8,D113)=0,COUNTIF('Data sources'!$I$11:$I$193,G113)=0,COUNTIF(PartnerN°,I113)=0,C113=\"\",E113=\"\",F113=\"\",K113=0),\"Error\",\"\")","v":"Error"}]
[null,"A95",null,null,null,null,null,null,null,"",null,null,{"$f":"IF(OR(COUNTIF('Data sources'!$I$4:$I$8,D114)=0,COUNTIF('Data sources'!$I$11:$I$193,G114)=0,COUNTIF(PartnerN°,I114)=0,C114=\"\",E114=\"\",F114=\"\",K114=0),\"Error\",\"\")","v":"Error"}]
[null,"A96",null,null,null,null,null,null,null,"",null,null,{"$f":"IF(OR(COUNTIF('Data sources'!$I$4:$I$8,D115)=0,COUNTIF('Data sources'!$I$11:$I$193,G115)=0,COUNTIF(PartnerN°,I115)=0,C115=\"\",E115=\"\",F115=\"\",K115=0),\"Error\",\"\")","v":"Error"}]
[null,"A97",null,null,null,null,null,null,null,{"$f":"IFERROR(IF(VLOOKUP(I116,PartnerN°Ref,2,FALSE)=0,\"\",VLOOKUP(I116,PartnerN°Ref,2,FALSE)),\"\")","v":""},null,null,{"$f":"IF(OR(COUNTIF('Data sources'!$I$4:$I$8,D116)=0,COUNTIF('Data sources'!$I$11:$I$193,G116)=0,COUNTIF(PartnerN°,I116)=0,C116=\"\",E116=\"\",F116=\"\",K116=0),\"Error\",\"\")","v":"Error"}]
[null,"A98",null,null,null,null,null,null,null,"",null,null,{"$f":"IF(OR(COUNTIF('Data sources'!$I$4:$I$8,D117)=0,COUNTIF('Data sources'!$I$11:$I$193,G117)=0,COUNTIF(PartnerN°,I117)=0,C117=\"\",E117=\"\",F117=\"\",K117=0),\"Error\",\"\")","v":"Error"}]
[null,"A99",null,null,null,null,null,null,null,"",null,null,{"$f":"IF(OR(COUNTIF('Data sources'!$I$4:$I$8,D118)=0,COUNTIF('Data sources'!$I$11:$I$193,G118)=0,COUNTIF(PartnerN°,I118)=0,C118=\"\",E118=\"\",F118=\"\",K118=0),\"Error\",\"\")","v":"Error"}]
[null,"A100",null,null,null,null,null,null,null,"",null,null,{"$f":"IF(OR(COUNTIF('Data sources'!$I$4:$I$8,D119)=0,COUNTIF('Data sources'!$I$11:$I$193,G119)=0,COUNTIF(PartnerN°,I119)=0,C119=\"\",E119=\"\",F119=\"\",K119=0),\"Error\",\"\")","v":"Error"}]
[null,"A101",null,null,null,null,null,null,null,"",null,null,{"$f":"IF(OR(COUNTIF('Data sources'!$I$4:$I$8,D120)=0,COUNTIF('Data sources'!$I$11:$I$193,G120)=0,COUNTIF(PartnerN°,I120)=0,C120=\"\",E120=\"\",F120=\"\",K120=0),\"Error\",\"\")","v":"Error"}]
[null,"A102",null,null,null,null,null,null,null,"",null,null,{"$f":"IF(OR(COUNTIF('Data sources'!$I$4:$I$8,D121)=0,COUNTIF('Data sources'!$I$11:$I$193,G121)=0,COUNTIF(PartnerN°,I121)=0,C121=\"\",E121=\"\",F121=\"\",K121=0),\"Error\",\"\")","v":"Error"}]
[null,"A103",null,null,null,null,null,null,null,"",null,null,{"$f":"IF(OR(COUNTIF('Data sources'!$I$4:$I$8,D122)=0,COUNTIF('Data sources'!$I$11:$I$193,G122)=0,COUNTIF(PartnerN°,I122)=0,C122=\"\",E122=\"\",F122=\"\",K122=0),\"Error\",\"\")","v":"Error"}]
[null,"A104",null,null,null,null,null,null,null,"",null,null,{"$f":"IF(OR(COUNTIF('Data sources'!$I$4:$I$8,D123)=0,COUNTIF('Data sources'!$I$11:$I$193,G123)=0,COUNTIF(PartnerN°,I123)=0,C123=\"\",E123=\"\",F123=\"\",K123=0),\"Error\",\"\")","v":"Error"}]
[null,"A105",null,null,null,null,null,null,null,"",null,null,{"$f":"IF(OR(COUNTIF('Data sources'!$I$4:$I$8,D124)=0,COUNTIF('Data sources'!$I$11:$I$193,G124)=0,COUNTIF(PartnerN°,I124)=0,C124=\"\",E124=\"\",F124=\"\",K124=0),\"Error\",\"\")","v":"Error"}]
[null,"A106",null,null,null,null,null,null,null,"",null,null,{"$f":"IF(OR(COUNTIF('Data sources'!$I$4:$I$8,D125)=0,COUNTIF('Data sources'!$I$11:$I$193,G125)=0,COUNTIF(PartnerN°,I125)=0,C125=\"\",E125=\"\",F125=\"\",K125=0),\"Error\",\"\")","v":"Error"}]
[null,"A107",null,null,null,null,null,null,null,"",null,null,{"$f":"IF(OR(COUNTIF('Data sources'!$I$4:$I$8,D126)=0,COUNTIF('Data sources'!$I$11:$I$193,G126)=0,COUNTIF(PartnerN°,I126)=0,C126=\"\",E126=\"\",F126=\"\",K126=0),\"Error\",\"\")","v":"Error"}]
[null,"A108",null,null,null,null,null,null,null,"",null,null,{"$f":"IF(OR(COUNTIF('Data sources'!$I$4:$I$8,D127)=0,COUNTIF('Data sources'!$I$11:$I$193,G127)=0,COUNTIF(PartnerN°,I127)=0,C127=\"\",E127=\"\",F127=\"\",K127=0),\"Error\",\"\")","v":"Error"}]
[null,"A109",null,null,null,null,null,null,null,"",null,null,{"$f":"IF(OR(COUNTIF('Data sources'!$I$4:$I$8,D128)=0,COUNTIF('Data sources'!$I$11:$I$193,G128)=0,COUNTIF(PartnerN°,I128)=0,C128=\"\",E128=\"\",F128=\"\",K128=0),\"Error\",\"\")","v":"Error"}]
[null,"A110",null,null,null,null,null,null,null,"",null,null,{"$f":"IF(OR(COUNTIF('Data sources'!$I$4:$I$8,D129)=0,COUNTIF('Data sources'!$I$11:$I$193,G129)=0,COUNTIF(PartnerN°,I129)=0,C129=\"\",E129=\"\",F129=\"\",K129=0),\"Error\",\"\")","v":"Error"}]
[null,"A111",null,null,null,null,null,null,null,"",null,null,{"$f":"IF(OR(COUNTIF('Data sources'!$I$4:$I$8,D130)=0,COUNTIF('Data sources'!$I$11:$I$193,G130)=0,COUNTIF(PartnerN°,I130)=0,C130=\"\",E130=\"\",F130=\"\",K130=0),\"Error\",\"\")","v":"Error"}]
[null,"A112",null,null,null,null,null,null,null,"",null,null,{"$f":"IF(OR(COUNTIF('Data sources'!$I$4:$I$8,D131)=0,COUNTIF('Data sources'!$I$11:$I$193,G131)=0,COUNTIF(PartnerN°,I131)=0,C131=\"\",E131=\"\",F131=\"\",K131=0),\"Error\",\"\")","v":"Error"}]
[null,"A113",null,null,null,null,null,null,null,"",null,null,{"$f":"IF(OR(COUNTIF('Data sources'!$I$4:$I$8,D132)=0,COUNTIF('Data sources'!$I$11:$I$193,G132)=0,COUNTIF(PartnerN°,I132)=0,C132=\"\",E132=\"\",F132=\"\",K132=0),\"Error\",\"\")","v":"Error"}]
[null,"A114",null,null,null,null,null,null,null,"",null,null,{"$f":"IF(OR(COUNTIF('Data sources'!$I$4:$I$8,D133)=0,COUNTIF('Data sources'!$I$11:$I$193,G133)=0,COUNTIF(PartnerN°,I133)=0,C133=\"\",E133=\"\",F133=\"\",K133=0),\"Error\",\"\")","v":"Error"}]
[null,"A115",null,null,null,null,null,null,null,"",null,null,{"$f":"IF(OR(COUNTIF('Data sources'!$I$4:$I$8,D134)=0,COUNTIF('Data sources'!$I$11:$I$193,G134)=0,COUNTIF(PartnerN°,I134)=0,C134=\"\",E134=\"\",F134=\"\",K134=0),\"Error\",\"\")","v":"Error"}]
[null,"A116",null,null,null,null,null,null,null,"",null,null,{"$f":"IF(OR(COUNTIF('Data sources'!$I$4:$I$8,D135)=0,COUNTIF('Data sources'!$I$11:$I$193,G135)=0,COUNTIF(PartnerN°,I135)=0,C135=\"\",E135=\"\",F135=\"\",K135=0),\"Error\",\"\")","v":"Error"}]
[null,"A117",null,null,null,null,null,null,null,"",null,null,{"$f":"IF(OR(COUNTIF('Data sources'!$I$4:$I$8,D136)=0,COUNTIF('Data sources'!$I$11:$I$193,G136)=0,COUNTIF(PartnerN°,I136)=0,C136=\"\",E136=\"\",F136=\"\",K136=0),\"Error\",\"\")","v":"Error"}]
[null,"A118",null,null,null,null,null,null,null,"",null,null,{"$f":"IF(OR(COUNTIF('Data sources'!$I$4:$I$8,D137)=0,COUNTIF('Data sources'!$I$11:$I$193,G137)=0,COUNTIF(PartnerN°,I137)=0,C137=\"\",E137=\"\",F137=\"\",K137=0),\"Error\",\"\")","v":"Error"}]
[null,"A119",null,null,null,null,null,null,null,"",null,null,{"$f":"IF(OR(COUNTIF('Data sources'!$I$4:$I$8,D138)=0,COUNTIF('Data sources'!$I$11:$I$193,G138)=0,COUNTIF(PartnerN°,I138)=0,C138=\"\",E138=\"\",F138=\"\",K138=0),\"Error\",\"\")","v":"Error"}]
[null,"A120",null,null,null,null,null,null,null,"",null,null,{"$f":"IF(OR(COUNTIF('Data sources'!$I$4:$I$8,D139)=0,COUNTIF('Data sources'!$I$11:$I$193,G139)=0,COUNTIF(PartnerN°,I139)=0,C139=\"\",E139=\"\",F139=\"\",K139=0),\"Error\",\"\")","v":"Error"}]
[null,"A121",null,null,null,null,null,null,null,"",null,null,{"$f":"IF(OR(COUNTIF('Data sources'!$I$4:$I$8,D140)=0,COUNTIF('Data sources'!$I$11:$I$193,G140)=0,COUNTIF(PartnerN°,I140)=0,C140=\"\",E140=\"\",F140=\"\",K140=0),\"Error\",\"\")","v":"Error"}]
[null,"A122",null,null,null,null,null,null,null,"",null,null,{"$f":"IF(OR(COUNTIF('Data sources'!$I$4:$I$8,D141)=0,COUNTIF('Data sources'!$I$11:$I$193,G141)=0,COUNTIF(PartnerN°,I141)=0,C141=\"\",E141=\"\",F141=\"\",K141=0),\"Error\",\"\")","v":"Error"}]
[null,"A123",null,null,null,null,null,null,null,"",null,null,{"$f":"IF(OR(COUNTIF('Data sources'!$I$4:$I$8,D142)=0,COUNTIF('Data sources'!$I$11:$I$193,G142)=0,COUNTIF(PartnerN°,I142)=0,C142=\"\",E142=\"\",F142=\"\",K142=0),\"Error\",\"\")","v":"Error"}]
[null,"A124",null,null,null,null,null,null,null,"",null,null,{"$f":"IF(OR(COUNTIF('Data sources'!$I$4:$I$8,D143)=0,COUNTIF('Data sources'!$I$11:$I$193,G143)=0,COUNTIF(PartnerN°,I143)=0,C143=\"\",E143=\"\",F143=\"\",K143=0),\"Error\",\"\")","v":"Error"}]
[null,"A125",null,null,null,null,null,null,null,"",null,null,{"$f":"IF(OR(COUNTIF('Data sources'!$I$4:$I$8,D144)=0,COUNTIF('Data sources'!$I$11:$I$193,G144)=0,COUNTIF(PartnerN°,I144)=0,C144=\"\",E144=\"\",F144=\"\",K144=0),\"Error\",\"\")","v":"Error"}]
[null,"A126",null,null,null,null,null,null,null,"",null,null,{"$f":"IF(OR(COUNTIF('Data sources'!$I$4:$I$8,D145)=0,COUNTIF('Data sources'!$I$11:$I$193,G145)=0,COUNTIF(PartnerN°,I145)=0,C145=\"\",E145=\"\",F145=\"\",K145=0),\"Error\",\"\")","v":"Error"}]
[null,"A127",null,null,null,null,null,null,null,"",null,null,{"$f":"IF(OR(COUNTIF('Data sources'!$I$4:$I$8,D146)=0,COUNTIF('Data sources'!$I$11:$I$193,G146)=0,COUNTIF(PartnerN°,I146)=0,C146=\"\",E146=\"\",F146=\"\",K146=0),\"Error\",\"\")","v":"Error"}]
[null,"A128",null,null,null,null,null,null,null,"",null,null,{"$f":"IF(OR(COUNTIF('Data sources'!$I$4:$I$8,D147)=0,COUNTIF('Data sources'!$I$11:$I$193,G147)=0,COUNTIF(PartnerN°,I147)=0,C147=\"\",E147=\"\",F147=\"\",K147=0),\"Error\",\"\")","v":"Error"}]
[null,"A129",null,null,null,null,null,null,null,{"$f":"IFERROR(IF(VLOOKUP(I148,PartnerN°Ref,2,FALSE)=0,\"\",VLOOKUP(I148,PartnerN°Ref,2,FALSE)),\"\")","v":""},null,null,{"$f":"IF(OR(COUNTIF('Data sources'!$I$4:$I$8,D148)=0,COUNTIF('Data sources'!$I$11:$I$193,G148)=0,COUNTIF(PartnerN°,I148)=0,C148=\"\",E148=\"\",F148=\"\",K148=0),\"Error\",\"\")","v":"Error"}]
[null,"A130",null,null,null,null,null,null,null,"",null,null,{"$f":"IF(OR(COUNTIF('Data sources'!$I$4:$I$8,D149)=0,COUNTIF('Data sources'!$I$11:$I$193,G149)=0,COUNTIF(PartnerN°,I149)=0,C149=\"\",E149=\"\",F149=\"\",K149=0),\"Error\",\"\")","v":"Error"}]
[null,"A131",null,null,null,null,null,null,null,"",null,null,{"$f":"IF(OR(COUNTIF('Data sources'!$I$4:$I$8,D150)=0,COUNTIF('Data sources'!$I$11:$I$193,G150)=0,COUNTIF(PartnerN°,I150)=0,C150=\"\",E150=\"\",F150=\"\",K150=0),\"Error\",\"\")","v":"Error"}]
[null,"A132",null,null,null,null,null,null,null,"",null,null,{"$f":"IF(OR(COUNTIF('Data sources'!$I$4:$I$8,D151)=0,COUNTIF('Data sources'!$I$11:$I$193,G151)=0,COUNTIF(PartnerN°,I151)=0,C151=\"\",E151=\"\",F151=\"\",K151=0),\"Error\",\"\")","v":"Error"}]
[null,"A133",null,null,null,null,null,null,null,"",null,null,{"$f":"IF(OR(COUNTIF('Data sources'!$I$4:$I$8,D152)=0,COUNTIF('Data sources'!$I$11:$I$193,G152)=0,COUNTIF(PartnerN°,I152)=0,C152=\"\",E152=\"\",F152=\"\",K152=0),\"Error\",\"\")","v":"Error"}]
[null,"A134",null,null,null,null,null,null,null,"",null,null,{"$f":"IF(OR(COUNTIF('Data sources'!$I$4:$I$8,D153)=0,COUNTIF('Data sources'!$I$11:$I$193,G153)=0,COUNTIF(PartnerN°,I153)=0,C153=\"\",E153=\"\",F153=\"\",K153=0),\"Error\",\"\")","v":"Error"}]
[null,"A135",null,null,null,null,null,null,null,"",null,null,{"$f":"IF(OR(COUNTIF('Data sources'!$I$4:$I$8,D154)=0,COUNTIF('Data sources'!$I$11:$I$193,G154)=0,COUNTIF(PartnerN°,I154)=0,C154=\"\",E154=\"\",F154=\"\",K154=0),\"Error\",\"\")","v":"Error"}]
[null,"A136",null,null,null,null,null,null,null,"",null,null,{"$f":"IF(OR(COUNTIF('Data sources'!$I$4:$I$8,D155)=0,COUNTIF('Data sources'!$I$11:$I$193,G155)=0,COUNTIF(PartnerN°,I155)=0,C155=\"\",E155=\"\",F155=\"\",K155=0),\"Error\",\"\")","v":"Error"}]
[null,"A137",null,null,null,null,null,null,null,"",null,null,{"$f":"IF(OR(COUNTIF('Data sources'!$I$4:$I$8,D156)=0,COUNTIF('Data sources'!$I$11:$I$193,G156)=0,COUNTIF(PartnerN°,I156)=0,C156=\"\",E156=\"\",F156=\"\",K156=0),\"Error\",\"\")","v":"Error"}]
[null,"A138",null,null,null,null,null,null,null,"",null,null,{"$f":"IF(OR(COUNTIF('Data sources'!$I$4:$I$8,D157)=0,COUNTIF('Data sources'!$I$11:$I$193,G157)=0,COUNTIF(PartnerN°,I157)=0,C157=\"\",E157=\"\",F157=\"\",K157=0),\"Error\",\"\")","v":"Error"}]
[null,"A139",null,null,null,null,null,null,null,"",null,null,{"$f":"IF(OR(COUNTIF('Data sources'!$I$4:$I$8,D158)=0,COUNTIF('Data sources'!$I$11:$I$193,G158)=0,COUNTIF(PartnerN°,I158)=0,C158=\"\",E158=\"\",F158=\"\",K158=0),\"Error\",\"\")","v":"Error"}]
[null,"A140",null,null,null,null,null,null,null,"",null,null,{"$f":"IF(OR(COUNTIF('Data sources'!$I$4:$I$8,D159)=0,COUNTIF('Data sources'!$I$11:$I$193,G159)=0,COUNTIF(PartnerN°,I159)=0,C159=\"\",E159=\"\",F159=\"\",K159=0),\"Error\",\"\")","v":"Error"}]
[null,"A141",null,null,null,null,null,null,null,"",null,null,{"$f":"IF(OR(COUNTIF('Data sources'!$I$4:$I$8,D160)=0,COUNTIF('Data sources'!$I$11:$I$193,G160)=0,COUNTIF(PartnerN°,I160)=0,C160=\"\",E160=\"\",F160=\"\",K160=0),\"Error\",\"\")","v":"Error"}]
[null,"A142",null,null,null,null,null,null,null,"",null,null,{"$f":"IF(OR(COUNTIF('Data sources'!$I$4:$I$8,D161)=0,COUNTIF('Data sources'!$I$11:$I$193,G161)=0,COUNTIF(PartnerN°,I161)=0,C161=\"\",E161=\"\",F161=\"\",K161=0),\"Error\",\"\")","v":"Error"}]
[null,"A143",null,null,null,null,null,null,null,"",null,null,{"$f":"IF(OR(COUNTIF('Data sources'!$I$4:$I$8,D162)=0,COUNTIF('Data sources'!$I$11:$I$193,G162)=0,COUNTIF(PartnerN°,I162)=0,C162=\"\",E162=\"\",F162=\"\",K162=0),\"Error\",\"\")","v":"Error"}]
[null,"A144",null,null,null,null,null,null,null,"",null,null,{"$f":"IF(OR(COUNTIF('Data sources'!$I$4:$I$8,D163)=0,COUNTIF('Data sources'!$I$11:$I$193,G163)=0,COUNTIF(PartnerN°,I163)=0,C163=\"\",E163=\"\",F163=\"\",K163=0),\"Error\",\"\")","v":"Error"}]
[null,"A145",null,null,null,null,null,null,null,"",null,null,{"$f":"IF(OR(COUNTIF('Data sources'!$I$4:$I$8,D164)=0,COUNTIF('Data sources'!$I$11:$I$193,G164)=0,COUNTIF(PartnerN°,I164)=0,C164=\"\",E164=\"\",F164=\"\",K164=0),\"Error\",\"\")","v":"Error"}]
[null,"A146",null,null,null,null,null,null,null,"",null,null,{"$f":"IF(OR(COUNTIF('Data sources'!$I$4:$I$8,D165)=0,COUNTIF('Data sources'!$I$11:$I$193,G165)=0,COUNTIF(PartnerN°,I165)=0,C165=\"\",E165=\"\",F165=\"\",K165=0),\"Error\",\"\")","v":"Error"}]
[null,"A147",null,null,null,null,null,null,null,"",null,null,{"$f":"IF(OR(COUNTIF('Data sources'!$I$4:$I$8,D166)=0,COUNTIF('Data sources'!$I$11:$I$193,G166)=0,COUNTIF(PartnerN°,I166)=0,C166=\"\",E166=\"\",F166=\"\",K166=0),\"Error\",\"\")","v":"Error"}]
[null,"A148",null,null,null,null,null,null,null,"",null,null,{"$f":"IF(OR(COUNTIF('Data sources'!$I$4:$I$8,D167)=0,COUNTIF('Data sources'!$I$11:$I$193,G167)=0,COUNTIF(PartnerN°,I167)=0,C167=\"\",E167=\"\",F167=\"\",K167=0),\"Error\",\"\")","v":"Error"}]
[null,"A149",null,null,null,null,null,null,null,"",null,null,{"$f":"IF(OR(COUNTIF('Data sources'!$I$4:$I$8,D168)=0,COUNTIF('Data sources'!$I$11:$I$193,G168)=0,COUNTIF(PartnerN°,I168)=0,C168=\"\",E168=\"\",F168=\"\",K168=0),\"Error\",\"\")","v":"Error"}]
[null,"A150",null,null,null,null,null,null,null,"",null,null,{"$f":"IF(OR(COUNTIF('Data sources'!$I$4:$I$8,D169)=0,COUNTIF('Data sources'!$I$11:$I$193,G169)=0,COUNTIF(PartnerN°,I169)=0,C169=\"\",E169=\"\",F169=\"\",K169=0),\"Error\",\"\")","v":"Error"}]
[null,"A151",null,null,null,null,null,null,null,"",null,null,{"$f":"IF(OR(COUNTIF('Data sources'!$I$4:$I$8,D170)=0,COUNTIF('Data sources'!$I$11:$I$193,G170)=0,COUNTIF(PartnerN°,I170)=0,C170=\"\",E170=\"\",F170=\"\",K170=0),\"Error\",\"\")","v":"Error"}]
[null,"A152",null,null,null,null,null,null,null,"",null,null,{"$f":"IF(OR(COUNTIF('Data sources'!$I$4:$I$8,D171)=0,COUNTIF('Data sources'!$I$11:$I$193,G171)=0,COUNTIF(PartnerN°,I171)=0,C171=\"\",E171=\"\",F171=\"\",K171=0),\"Error\",\"\")","v":"Error"}]
[null,"A153",null,null,null,null,null,null,null,"",null,null,{"$f":"IF(OR(COUNTIF('Data sources'!$I$4:$I$8,D172)=0,COUNTIF('Data sources'!$I$11:$I$193,G172)=0,COUNTIF(PartnerN°,I172)=0,C172=\"\",E172=\"\",F172=\"\",K172=0),\"Error\",\"\")","v":"Error"}]
[null,"A154",null,null,null,null,null,null,null,"",null,null,{"$f":"IF(OR(COUNTIF('Data sources'!$I$4:$I$8,D173)=0,COUNTIF('Data sources'!$I$11:$I$193,G173)=0,COUNTIF(PartnerN°,I173)=0,C173=\"\",E173=\"\",F173=\"\",K173=0),\"Error\",\"\")","v":"Error"}]
[null,"A155",null,null,null,null,null,null,null,"",null,null,{"$f":"IF(OR(COUNTIF('Data sources'!$I$4:$I$8,D174)=0,COUNTIF('Data sources'!$I$11:$I$193,G174)=0,COUNTIF(PartnerN°,I174)=0,C174=\"\",E174=\"\",F174=\"\",K174=0),\"Error\",\"\")","v":"Error"}]
[null,"A156",null,null,null,null,null,null,null,"",null,null,{"$f":"IF(OR(COUNTIF('Data sources'!$I$4:$I$8,D175)=0,COUNTIF('Data sources'!$I$11:$I$193,G175)=0,COUNTIF(PartnerN°,I175)=0,C175=\"\",E175=\"\",F175=\"\",K175=0),\"Error\",\"\")","v":"Error"}]
[null,"A157",null,null,null,null,null,null,null,"",null,null,{"$f":"IF(OR(COUNTIF('Data sources'!$I$4:$I$8,D176)=0,COUNTIF('Data sources'!$I$11:$I$193,G176)=0,COUNTIF(PartnerN°,I176)=0,C176=\"\",E176=\"\",F176=\"\",K176=0),\"Error\",\"\")","v":"Error"}]
[null,"A158",null,null,null,null,null,null,null,"",null,null,{"$f":"IF(OR(COUNTIF('Data sources'!$I$4:$I$8,D177)=0,COUNTIF('Data sources'!$I$11:$I$193,G177)=0,COUNTIF(PartnerN°,I177)=0,C177=\"\",E177=\"\",F177=\"\",K177=0),\"Error\",\"\")","v":"Error"}]
[null,"A159",null,null,null,null,null,null,null,"",null,null,{"$f":"IF(OR(COUNTIF('Data sources'!$I$4:$I$8,D178)=0,COUNTIF('Data sources'!$I$11:$I$193,G178)=0,COUNTIF(PartnerN°,I178)=0,C178=\"\",E178=\"\",F178=\"\",K178=0),\"Error\",\"\")","v":"Error"}]
[null,"A160",null,null,null,null,null,null,null,"",null,null,{"$f":"IF(OR(COUNTIF('Data sources'!$I$4:$I$8,D179)=0,COUNTIF('Data sources'!$I$11:$I$193,G179)=0,COUNTIF(PartnerN°,I179)=0,C179=\"\",E179=\"\",F179=\"\",K179=0),\"Error\",\"\")","v":"Error"}]
[null,"A161",null,null,null,null,null,null,null,{"$f":"IFERROR(IF(VLOOKUP(I180,PartnerN°Ref,2,FALSE)=0,\"\",VLOOKUP(I180,PartnerN°Ref,2,FALSE)),\"\")","v":""},null,null,{"$f":"IF(OR(COUNTIF('Data sources'!$I$4:$I$8,D180)=0,COUNTIF('Data sources'!$I$11:$I$193,G180)=0,COUNTIF(PartnerN°,I180)=0,C180=\"\",E180=\"\",F180=\"\",K180=0),\"Error\",\"\")","v":"Error"}]
[null,"A162",null,null,null,null,null,null,null,"",null,null,{"$f":"IF(OR(COUNTIF('Data sources'!$I$4:$I$8,D181)=0,COUNTIF('Data sources'!$I$11:$I$193,G181)=0,COUNTIF(PartnerN°,I181)=0,C181=\"\",E181=\"\",F181=\"\",K181=0),\"Error\",\"\")","v":"Error"}]
[null,"A163",null,null,null,null,null,null,null,"",null,null,{"$f":"IF(OR(COUNTIF('Data sources'!$I$4:$I$8,D182)=0,COUNTIF('Data sources'!$I$11:$I$193,G182)=0,COUNTIF(PartnerN°,I182)=0,C182=\"\",E182=\"\",F182=\"\",K182=0),\"Error\",\"\")","v":"Error"}]
[null,"A164",null,null,null,null,null,null,null,"",null,null,{"$f":"IF(OR(COUNTIF('Data sources'!$I$4:$I$8,D183)=0,COUNTIF('Data sources'!$I$11:$I$193,G183)=0,COUNTIF(PartnerN°,I183)=0,C183=\"\",E183=\"\",F183=\"\",K183=0),\"Error\",\"\")","v":"Error"}]
[null,"A165",null,null,null,null,null,null,null,"",null,null,{"$f":"IF(OR(COUNTIF('Data sources'!$I$4:$I$8,D184)=0,COUNTIF('Data sources'!$I$11:$I$193,G184)=0,COUNTIF(PartnerN°,I184)=0,C184=\"\",E184=\"\",F184=\"\",K184=0),\"Error\",\"\")","v":"Error"}]
[null,"A166",null,null,null,null,null,null,null,"",null,null,{"$f":"IF(OR(COUNTIF('Data sources'!$I$4:$I$8,D185)=0,COUNTIF('Data sources'!$I$11:$I$193,G185)=0,COUNTIF(PartnerN°,I185)=0,C185=\"\",E185=\"\",F185=\"\",K185=0),\"Error\",\"\")","v":"Error"}]
[null,"A167",null,null,null,null,null,null,null,"",null,null,{"$f":"IF(OR(COUNTIF('Data sources'!$I$4:$I$8,D186)=0,COUNTIF('Data sources'!$I$11:$I$193,G186)=0,COUNTIF(PartnerN°,I186)=0,C186=\"\",E186=\"\",F186=\"\",K186=0),\"Error\",\"\")","v":"Error"}]
[null,"A168",null,null,null,null,null,null,null,"",null,null,{"$f":"IF(OR(COUNTIF('Data sources'!$I$4:$I$8,D187)=0,COUNTIF('Data sources'!$I$11:$I$193,G187)=0,COUNTIF(PartnerN°,I187)=0,C187=\"\",E187=\"\",F187=\"\",K187=0),\"Error\",\"\")","v":"Error"}]
[null,"A169",null,null,null,null,null,null,null,"",null,null,{"$f":"IF(OR(COUNTIF('Data sources'!$I$4:$I$8,D188)=0,COUNTIF('Data sources'!$I$11:$I$193,G188)=0,COUNTIF(PartnerN°,I188)=0,C188=\"\",E188=\"\",F188=\"\",K188=0),\"Error\",\"\")","v":"Error"}]
[null,"A170",null,null,null,null,null,null,null,"",null,null,{"$f":"IF(OR(COUNTIF('Data sources'!$I$4:$I$8,D189)=0,COUNTIF('Data sources'!$I$11:$I$193,G189)=0,COUNTIF(PartnerN°,I189)=0,C189=\"\",E189=\"\",F189=\"\",K189=0),\"Error\",\"\")","v":"Error"}]
[null,"A171",null,null,null,null,null,null,null,"",null,null,{"$f":"IF(OR(COUNTIF('Data sources'!$I$4:$I$8,D190)=0,COUNTIF('Data sources'!$I$11:$I$193,G190)=0,COUNTIF(PartnerN°,I190)=0,C190=\"\",E190=\"\",F190=\"\",K190=0),\"Error\",\"\")","v":"Error"}]
[null,"A172",null,null,null,null,null,null,null,"",null,null,{"$f":"IF(OR(COUNTIF('Data sources'!$I$4:$I$8,D191)=0,COUNTIF('Data sources'!$I$11:$I$193,G191)=0,COUNTIF(PartnerN°,I191)=0,C191=\"\",E191=\"\",F191=\"\",K191=0),\"Error\",\"\")","v":"Error"}]
[null,"A173",null,null,null,null,null,null,null,"",null,null,{"$f":"IF(OR(COUNTIF('Data sources'!$I$4:$I$8,D192)=0,COUNTIF('Data sources'!$I$11:$I$193,G192)=0,COUNTIF(PartnerN°,I192)=0,C192=\"\",E192=\"\",F192=\"\",K192=0),\"Error\",\"\")","v":"Error"}]
[null,"A174",null,null,null,null,null,null,null,"",null,null,{"$f":"IF(OR(COUNTIF('Data sources'!$I$4:$I$8,D193)=0,COUNTIF('Data sources'!$I$11:$I$193,G193)=0,COUNTIF(PartnerN°,I193)=0,C193=\"\",E193=\"\",F193=\"\",K193=0),\"Error\",\"\")","v":"Error"}]
[null,"A175",null,null,null,null,null,null,null,"",null,null,{"$f":"IF(OR(COUNTIF('Data sources'!$I$4:$I$8,D194)=0,COUNTIF('Data sources'!$I$11:$I$193,G194)=0,COUNTIF(PartnerN°,I194)=0,C194=\"\",E194=\"\",F194=\"\",K194=0),\"Error\",\"\")","v":"Error"}]
[null,"A176",null,null,null,null,null,null,null,"",null,null,{"$f":"IF(OR(COUNTIF('Data sources'!$I$4:$I$8,D195)=0,COUNTIF('Data sources'!$I$11:$I$193,G195)=0,COUNTIF(PartnerN°,I195)=0,C195=\"\",E195=\"\",F195=\"\",K195=0),\"Error\",\"\")","v":"Error"}]
[null,"A177",null,null,null,null,null,null,null,"",null,null,{"$f":"IF(OR(COUNTIF('Data sources'!$I$4:$I$8,D196)=0,COUNTIF('Data sources'!$I$11:$I$193,G196)=0,COUNTIF(PartnerN°,I196)=0,C196=\"\",E196=\"\",F196=\"\",K196=0),\"Error\",\"\")","v":"Error"}]
[null,"A178",null,null,null,null,null,null,null,"",null,null,{"$f":"IF(OR(COUNTIF('Data sources'!$I$4:$I$8,D197)=0,COUNTIF('Data sources'!$I$11:$I$193,G197)=0,COUNTIF(PartnerN°,I197)=0,C197=\"\",E197=\"\",F197=\"\",K197=0),\"Error\",\"\")","v":"Error"}]
[null,"A179",null,null,null,null,null,null,null,"",null,null,{"$f":"IF(OR(COUNTIF('Data sources'!$I$4:$I$8,D198)=0,COUNTIF('Data sources'!$I$11:$I$193,G198)=0,COUNTIF(PartnerN°,I198)=0,C198=\"\",E198=\"\",F198=\"\",K198=0),\"Error\",\"\")","v":"Error"}]
[null,"A180",null,null,null,null,null,null,null,"",null,null,{"$f":"IF(OR(COUNTIF('Data sources'!$I$4:$I$8,D199)=0,COUNTIF('Data sources'!$I$11:$I$193,G199)=0,COUNTIF(PartnerN°,I199)=0,C199=\"\",E199=\"\",F199=\"\",K199=0),\"Error\",\"\")","v":"Error"}]
[null,"A181",null,null,null,null,null,null,null,"",null,null,{"$f":"IF(OR(COUNTIF('Data sources'!$I$4:$I$8,D200)=0,COUNTIF('Data sources'!$I$11:$I$193,G200)=0,COUNTIF(PartnerN°,I200)=0,C200=\"\",E200=\"\",F200=\"\",K200=0),\"Error\",\"\")","v":"Error"}]
[null,"A182",null,null,null,null,null,null,null,"",null,null,{"$f":"IF(OR(COUNTIF('Data sources'!$I$4:$I$8,D201)=0,COUNTIF('Data sources'!$I$11:$I$193,G201)=0,COUNTIF(PartnerN°,I201)=0,C201=\"\",E201=\"\",F201=\"\",K201=0),\"Error\",\"\")","v":"Error"}]
[null,"A183",null,null,null,null,null,null,null,"",null,null,{"$f":"IF(OR(COUNTIF('Data sources'!$I$4:$I$8,D202)=0,COUNTIF('Data sources'!$I$11:$I$193,G202)=0,COUNTIF(PartnerN°,I202)=0,C202=\"\",E202=\"\",F202=\"\",K202=0),\"Error\",\"\")","v":"Error"}]
[null,"A184",null,null,null,null,null,null,null,"",null,null,{"$f":"IF(OR(COUNTIF('Data sources'!$I$4:$I$8,D203)=0,COUNTIF('Data sources'!$I$11:$I$193,G203)=0,COUNTIF(PartnerN°,I203)=0,C203=\"\",E203=\"\",F203=\"\",K203=0),\"Error\",\"\")","v":"Error"}]
[null,"A185",null,null,null,null,null,null,null,"",null,null,{"$f":"IF(OR(COUNTIF('Data sources'!$I$4:$I$8,D204)=0,COUNTIF('Data sources'!$I$11:$I$193,G204)=0,COUNTIF(PartnerN°,I204)=0,C204=\"\",E204=\"\",F204=\"\",K204=0),\"Error\",\"\")","v":"Error"}]
[null,"A186",null,null,null,null,null,null,null,"",null,null,{"$f":"IF(OR(COUNTIF('Data sources'!$I$4:$I$8,D205)=0,COUNTIF('Data sources'!$I$11:$I$193,G205)=0,COUNTIF(PartnerN°,I205)=0,C205=\"\",E205=\"\",F205=\"\",K205=0),\"Error\",\"\")","v":"Error"}]
[null,"A187",null,null,null,null,null,null,null,"",null,null,{"$f":"IF(OR(COUNTIF('Data sources'!$I$4:$I$8,D206)=0,COUNTIF('Data sources'!$I$11:$I$193,G206)=0,COUNTIF(PartnerN°,I206)=0,C206=\"\",E206=\"\",F206=\"\",K206=0),\"Error\",\"\")","v":"Error"}]
[null,"A188",null,null,null,null,null,null,null,"",null,null,{"$f":"IF(OR(COUNTIF('Data sources'!$I$4:$I$8,D207)=0,COUNTIF('Data sources'!$I$11:$I$193,G207)=0,COUNTIF(PartnerN°,I207)=0,C207=\"\",E207=\"\",F207=\"\",K207=0),\"Error\",\"\")","v":"Error"}]
[null,"A189",null,null,null,null,null,null,null,"",null,null,{"$f":"IF(OR(COUNTIF('Data sources'!$I$4:$I$8,D208)=0,COUNTIF('Data sources'!$I$11:$I$193,G208)=0,COUNTIF(PartnerN°,I208)=0,C208=\"\",E208=\"\",F208=\"\",K208=0),\"Error\",\"\")","v":"Error"}]
[null,"A190",null,null,null,null,null,null,null,"",null,null,{"$f":"IF(OR(COUNTIF('Data sources'!$I$4:$I$8,D209)=0,COUNTIF('Data sources'!$I$11:$I$193,G209)=0,COUNTIF(PartnerN°,I209)=0,C209=\"\",E209=\"\",F209=\"\",K209=0),\"Error\",\"\")","v":"Error"}]
[null,"A191",null,null,null,null,null,null,null,"",null,null,{"$f":"IF(OR(COUNTIF('Data sources'!$I$4:$I$8,D210)=0,COUNTIF('Data sources'!$I$11:$I$193,G210)=0,COUNTIF(PartnerN°,I210)=0,C210=\"\",E210=\"\",F210=\"\",K210=0),\"Error\",\"\")","v":"Error"}]
[null,"A192",null,null,null,null,null,null,null,"",null,null,{"$f":"IF(OR(COUNTIF('Data sources'!$I$4:$I$8,D211)=0,COUNTIF('Data sources'!$I$11:$I$193,G211)=0,COUNTIF(PartnerN°,I211)=0,C211=\"\",E211=\"\",F211=\"\",K211=0),\"Error\",\"\")","v":"Error"}]
[null,"A193",null,null,null,null,null,null,null,{"$f":"IFERROR(IF(VLOOKUP(I212,PartnerN°Ref,2,FALSE)=0,\"\",VLOOKUP(I212,PartnerN°Ref,2,FALSE)),\"\")","v":""},null,null,{"$f":"IF(OR(COUNTIF('Data sources'!$I$4:$I$8,D212)=0,COUNTIF('Data sources'!$I$11:$I$193,G212)=0,COUNTIF(PartnerN°,I212)=0,C212=\"\",E212=\"\",F212=\"\",K212=0),\"Error\",\"\")","v":"Error"}]
[null,"A194",null,null,null,null,null,null,null,"",null,null,{"$f":"IF(OR(COUNTIF('Data sources'!$I$4:$I$8,D213)=0,COUNTIF('Data sources'!$I$11:$I$193,G213)=0,COUNTIF(PartnerN°,I213)=0,C213=\"\",E213=\"\",F213=\"\",K213=0),\"Error\",\"\")","v":"Error"}]
[null,"A195",null,null,null,null,null,null,null,"",null,null,{"$f":"IF(OR(COUNTIF('Data sources'!$I$4:$I$8,D214)=0,COUNTIF('Data sources'!$I$11:$I$193,G214)=0,COUNTIF(PartnerN°,I214)=0,C214=\"\",E214=\"\",F214=\"\",K214=0),\"Error\",\"\")","v":"Error"}]
[null,"A196",null,null,null,null,null,null,null,"",null,null,{"$f":"IF(OR(COUNTIF('Data sources'!$I$4:$I$8,D215)=0,COUNTIF('Data sources'!$I$11:$I$193,G215)=0,COUNTIF(PartnerN°,I215)=0,C215=\"\",E215=\"\",F215=\"\",K215=0),\"Error\",\"\")","v":"Error"}]
[null,"A197",null,null,null,null,null,null,null,"",null,null,{"$f":"IF(OR(COUNTIF('Data sources'!$I$4:$I$8,D216)=0,COUNTIF('Data sources'!$I$11:$I$193,G216)=0,COUNTIF(PartnerN°,I216)=0,C216=\"\",E216=\"\",F216=\"\",K216=0),\"Error\",\"\")","v":"Error"}]
[null,"A198",null,null,null,null,null,null,null,"",null,null,{"$f":"IF(OR(COUNTIF('Data sources'!$I$4:$I$8,D217)=0,COUNTIF('Data sources'!$I$11:$I$193,G217)=0,COUNTIF(PartnerN°,I217)=0,C217=\"\",E217=\"\",F217=\"\",K217=0),\"Error\",\"\")","v":"Error"}]
[null,"A199",null,null,null,null,null,null,null,"",null,null,{"$f":"IF(OR(COUNTIF('Data sources'!$I$4:$I$8,D218)=0,COUNTIF('Data sources'!$I$11:$I$193,G218)=0,COUNTIF(PartnerN°,I218)=0,C218=\"\",E218=\"\",F218=\"\",K218=0),\"Error\",\"\")","v":"Error"}]
[null,"A200",null,null,null,null,null,null,null,"",null,null,{"$f":"IF(OR(COUNTIF('Data sources'!$I$4:$I$8,D219)=0,COUNTIF('Data sources'!$I$11:$I$193,G219)=0,COUNTIF(PartnerN°,I219)=0,C219=\"\",E219=\"\",F219=\"\",K219=0),\"Error\",\"\")","v":"Error"}]

{"sheet":"1. Costs linked to activities","index":2,"n_rows":15,"n_cols":13,"rows_kept":15,"cut":false,"hidden":false,"merged":[[10,12,11,12],[0,1,0,9],[1,1,1,9],[2,1,2,9],[3,1,8,1],[3,2,8,3],[3,5,8,6],[3,7,8,7],[10,9,11,9],[10,10,11,10],[10,1,11,1],[10,3,11,3],[10,8,11,8],[9,1,9,9],[10,2,11,2],[10,4,11,4],[10,5,11,5],[10,6,11,6],[10,7,11,7]]}
[]
[null,"1. COSTS DIRECTLY LINKED TO THE IMPLEMENTATION OF PROJECT ACTIVITIES"]
[]
[null,"Total (EUR)",{"$f":"SUM(K:K)","v":0},null,null,"Total (EUR) Financial support to third parties\n (Max. EUR 60.000 per third party)",null,{"$f":"SUMIF(H:H,'Data sources'!B13,'1. Costs linked to activities'!K:K)","v":0}]
[]
[]
[]
[]
[]
[]
[null,"Activity N°","Name of Activity\n(to encode in Action Plan sheet)","Work\nPackage\n(to encode in Action Plan  sheet)","Partner \nN°","Name of Partner\n(to encode in overview sheet)","Country\n(to encode in overview sheet)","Specification of the item","Explanation about nature, type of  the expense","Amount\n(EUR)","Total\n(EUR)",null,"Check\nData\nEncoding"]
[]
[null,null,{"$f":"IFERROR(IF(VLOOKUP(B13,'Action  Plan'!$B$20:$C$219,2,FALSE)=0,\"\",VLOOKUP(B13,'Action  Plan'!$B$20:$C$219,2,FALSE)),\"\")","v":""},{"$f":"IFERROR(IF(VLOOKUP(B13,'Action  Plan'!$B$20:$D$219,3,FALSE)=0,\"\",VLOOKUP(B13,'Action  Plan'!$B$20:$D$219,3,FALSE)),\"\")","v":""},null,{"$f":"IFERROR(IF(VLOOKUP(E13,Overview!$B$32:$C$86,2,FALSE)=0,\"\",VLOOKUP(E13,Overview!$B$32:$C$86,2,FALSE)),\"\")","v":""},{"$f":"IFERROR(IF(OR(VLOOKUP(E13,Overview!$B$32:$D$87,3,FALSE)=\"Country not found\",VLOOKUP(E13,Overview!$B$32:$D$87,3,FALSE)=0),\"\",VLOOKUP(E13,Overview!$B$32:$D$87,3,FALSE)),\"\")","v":""},null,null,0,{"$f":"IF(M13=\"Error\",0,ROUND(J13,2))","v":0},null,{"$f":"IF(OR(COUNTIF('Action  Plan'!$B$19:$B$218,B13)=0,COUNTIF(PartnerN°,E13)=0,COUNTIF('Data sources'!$B$4:$B$14,H13)=0,I13=\"\",J13=0),\"Error\",\"\")","v":"Error"}]
[null,null,{"$f":"IFERROR(IF(VLOOKUP(B14,'Action  Plan'!$B$20:$C$219,2,FALSE)=0,\"\",VLOOKUP(B14,'Action  Plan'!$B$20:$C$219,2,FALSE)),\"\")","v":""},{"$f":"IFERROR(IF(VLOOKUP(B14,'Action  Plan'!$B$20:$D$219,3,FALSE)=0,\"\",VLOOKUP(B14,'Action  Plan'!$B$20:$D$219,3,FALSE)),\"\")","v":""},null,{"$f":"IFERROR(IF(VLOOKUP(E14,Overview!$B$32:$C$86,2,FALSE)=0,\"\",VLOOKUP(E14,Overview!$B$32:$C$86,2,FALSE)),\"\")","v":""},{"$f":"IFERROR(IF(OR(VLOOKUP(E14,Overview!$B$32:$D$87,3,FALSE)=\"Country not found\",VLOOKUP(E14,Overview!$B$32:$D$87,3,FALSE)=0),\"\",VLOOKUP(E14,Overview!$B$32:$D$87,3,FALSE)),\"\")","v":""},null,null,null,{"$f":"IF(M14=\"Error\",0,ROUND(J14,2))","v":0},null,{"$f":"IF(OR(COUNTIF('Action  Plan'!$B$19:$B$218,B14)=0,COUNTIF(PartnerN°,E14)=0,COUNTIF('Data sources'!$B$4:$B$14,H14)=0,I14=\"\",J14=0),\"Error\",\"\")","v":"Error"}]
[null,null,{"$f":"IFERROR(IF(VLOOKUP(B15,'Action  Plan'!$B$20:$C$219,2,FALSE)=0,\"\",VLOOKUP(B15,'Action  Plan'!$B$20:$C$219,2,FALSE)),\"\")","v":""},{"$f":"IFERROR(IF(VLOOKUP(B15,'Action  Plan'!$B$20:$D$219,3,FALSE)=0,\"\",VLOOKUP(B15,'Action  Plan'!$B$20:$D$219,3,FALSE)),\"\")","v":""},null,{"$f":"IFERROR(IF(VLOOKUP(E15,Overview!$B$32:$C$86,2,FALSE)=0,\"\",VLOOKUP(E15,Overview!$B$32:$C$86,2,FALSE)),\"\")","v":""},{"$f":"IFERROR(IF(OR(VLOOKUP(E15,Overview!$B$32:$D$87,3,FALSE)=\"Country not found\",VLOOKUP(E15,Overview!$B$32:$D$87,3,FALSE)=0),\"\",VLOOKUP(E15,Overview!$B$32:$D$87,3,FALSE)),\"\")","v":""},null,null,null,{"$f":"IF(M15=\"Error\",0,ROUND(J15,2))","v":0},null,{"$f":"IF(OR(COUNTIF('Action  Plan'!$B$19:$B$218,B15)=0,COUNTIF(PartnerN°,E15)=0,COUNTIF('Data sources'!$B$4:$B$14,H15)=0,I15=\"\",J15=0),\"Error\",\"\")","v":"Error"}]

{"sheet":"2. Communication Costs","index":3,"n_rows":14,"n_cols":13,"rows_kept":14,"cut":false,"hidden":false,"merged":[[10,8,11,8],[10,9,11,9],[10,12,11,12],[10,10,11,10],[0,1,0,9],[1,1,1,9],[2,1,2,9],[3,1,8,1],[3,2,8,3],[3,4,8,9],[9,1,9,9],[10,1,11,1],[10,2,11,2],[10,3,11,3],[10,4,11,4],[10,5,11,5],[10,6,11,6],[10,7,11,7]]}
[]
[null,"                                      2. COMMUNICATION, PROMOTION AND DISSEMINATION COSTS AND COSTS OF EXPLOITATION OF RESULTS"]
[]
[null,"Total (EUR)",{"$f":"SUM(K:K)","v":0}]
[]
[]
[]
[]
[]
[]
[null,"Activity N°","Name of Activity\n(to encode in Action Plan sheet)","Work\nPackage\n(to encode in Action Plan  sheet)","Partner \nN°","Name of Partner\n(to encode in overview sheet)","Country\n(to encode in overview sheet)","Specification of the item","Explanation about nature, type of  the expense","Amount\n(EUR)","Total\n(EUR)",null,"Check\nData\nEncoding"]
[]
[null,null,{"$f":"IFERROR(IF(VLOOKUP(B13,'Action  Plan'!$B$20:$C$219,2,FALSE)=0,\"\",VLOOKUP(B13,'Action  Plan'!$B$20:$C$219,2,FALSE)),\"\")","v":""},{"$f":"IFERROR(IF(VLOOKUP(B13,'Action  Plan'!$B$20:$D$219,3,FALSE)=0,\"\",VLOOKUP(B13,'Action  Plan'!$B$20:$D$219,3,FALSE)),\"\")","v":""},null,{"$f":"IFERROR(IF(VLOOKUP(E13,Overview!$B$32:$C$86,2,FALSE)=0,\"\",VLOOKUP(E13,Overview!$B$32:$C$86,2,FALSE)),\"\")","v":""},{"$f":"IFERROR(IF(OR(VLOOKUP(E13,Overview!$B$32:$D$87,3,FALSE)=\"Country not found\",VLOOKUP(E13,Overview!$B$32:$D$87,3,FALSE)=0),\"\",VLOOKUP(E13,Overview!$B$32:$D$87,3,FALSE)),\"\")","v":""},null,null,0,{"$f":"IF(M13=\"Error\",0,ROUND(J13,2))","v":0},null,{"$f":"IF(OR(COUNTIF('Action  Plan'!$B$19:$B$218,B13)=0,COUNTIF(PartnerN°,E13)=0,COUNTIF('Data sources'!$B$17:$B$24,H13)=0,I13=\"\",J13=0),\"Error\",\"\")","v":"Error"}]
[null,null,{"$f":"IFERROR(IF(VLOOKUP(B14,'Action  Plan'!$B$20:$C$219,2,FALSE)=0,\"\",VLOOKUP(B14,'Action  Plan'!$B$20:$C$219,2,FALSE)),\"\")","v":""},{"$f":"IFERROR(IF(VLOOKUP(B14,'Action  Plan'!$B$20:$D$219,3,FALSE)=0,\"\",VLOOKUP(B14,'Action  Plan'!$B$20:$D$219,3,FALSE)),\"\")","v":""},null,{"$f":"IFERROR(IF(VLOOKUP(E14,Overview!$B$32:$C$86,2,FALSE)=0,\"\",VLOOKUP(E14,Overview!$B$32:$C$86,2,FALSE)),\"\")","v":""},{"$f":"IFERROR(IF(OR(VLOOKUP(E14,Overview!$B$32:$D$87,3,FALSE)=\"Country not found\",VLOOKUP(E14,Overview!$B$32:$D$87,3,FALSE)=0),\"\",VLOOKUP(E14,Overview!$B$32:$D$87,3,FALSE)),\"\")","v":""},null,null,0,{"$f":"IF(M14=\"Error\",0,ROUND(J14,2))","v":0},null,{"$f":"IF(OR(COUNTIF('Action  Plan'!$B$19:$B$218,B14)=0,COUNTIF(PartnerN°,E14)=0,COUNTIF('Data sources'!$B$17:$B$24,H14)=0,I14=\"\",J14=0),\"Error\",\"\")","v":"Error"}]

{"sheet":"3. Travel & Subsistence costs","index":4,"n_rows":14,"n_cols":20,"rows_kept":14,"cut":false,"hidden":false,"merged":[[1,1,1,17],[8,1,8,2],[10,3,11,3],[10,4,11,4],[10,7,11,7],[10,9,11,9],[10,11,11,11],[10,8,11,8],[10,6,11,6],[10,5,11,5],[10,1,11,1],[10,2,11,2],[3,1,4,2],[5,1,6,2],[3,3,4,3],[5,3,6,3],[10,10,11,10],[10,13,11,13],[10,15,11,15],[10,19,11,19],[10,17,11,17],[10,16,11,16],[10,12,11,12],[10,14,11,14]]}
[]
[null,"3. TRAVEL & SUBSISTENCE COSTS"]
[]
[null,"Total Travel Costs (EUR)",null,{"$f":"SUM(M:M)","v":0}]
[]
[null,"Total Costs of Stay (EUR)",null,{"$f":"SUM(Q:Q)","v":0}]
[]
[]
[null,"Total Chapter 3",null,{"$f":"SUM(D4:D6)","v":0}]
[]
[null,"Activity N°","Name of Activity\n(to encode in Action Plan sheet)","Work\nPackage\n(to encode in Action Plan  sheet)","Partner \nN°","Name of Partner\n(to encode in overview sheet)","Country\n(to encode in overview sheet)","CITY of Departure","Person travelling","City of Destination","Unit cost per travel","Number of \nParticipants","Total Travel \nCosts\n(EUR)","Unit cost per day","Number of \ndays (per participant)","Number of \nParticipants","Costs of\nStay\n(EUR)","Total \n(EUR)",null,"Check\nData\nEncoding"]
[]
[null,null,{"$f":"IFERROR(IF(VLOOKUP(B13,'Action  Plan'!$B$20:$C$219,2,FALSE)=0,\"\",VLOOKUP(B13,'Action  Plan'!$B$20:$C$219,2,FALSE)),\"\")","v":""},{"$f":"IFERROR(IF(VLOOKUP(B13,'Action  Plan'!$B$20:$D$219,3,FALSE)=0,\"\",VLOOKUP(B13,'Action  Plan'!$B$20:$D$219,3,FALSE)),\"\")","v":""},null,{"$f":"IFERROR(IF(VLOOKUP(E13,Overview!$B$32:$C$86,2,FALSE)=0,\"\",VLOOKUP(E13,Overview!$B$32:$C$86,2,FALSE)),\"\")","v":""},{"$f":"IFERROR(IF(OR(VLOOKUP(E13,Overview!$B$32:$D$87,3,FALSE)=\"Country not found\",VLOOKUP(E13,Overview!$B$32:$D$87,3,FALSE)=0),\"\",VLOOKUP(E13,Overview!$B$32:$D$87,3,FALSE)),\"\")","v":""},null,null,null,0,0,{"$f":"K13*L13","v":0},0,0,0,{"$f":"N13*O13*P13","v":0},{"$f":"IF(T13=\"Error\",0,ROUND(M13+Q13,2))","v":0},null,{"$f":"IF(OR(COUNTIF('Action  Plan'!$B$19:$B$218,B13)=0,COUNTIF(PartnerN°,E13)=0,H13=\"\",COUNTIF('Data sources'!$L$22:$L$24,I13)=0,J13=\"\",K13=0,L13=0,N13=0,O13=0,P13=0,M13+Q13=0),\"Error\",\"\")","v":"Error"}]
[null,null,{"$f":"IFERROR(IF(VLOOKUP(B14,'Action  Plan'!$B$20:$C$219,2,FALSE)=0,\"\",VLOOKUP(B14,'Action  Plan'!$B$20:$C$219,2,FALSE)),\"\")","v":""},{"$f":"IFERROR(IF(VLOOKUP(B14,'Action  Plan'!$B$20:$D$219,3,FALSE)=0,\"\",VLOOKUP(B14,'Action  Plan'!$B$20:$D$219,3,FALSE)),\"\")","v":""},null,{"$f":"IFERROR(IF(VLOOKUP(E14,Overview!$B$32:$C$86,2,FALSE)=0,\"\",VLOOKUP(E14,Overview!$B$32:$C$86,2,FALSE)),\"\")","v":""},{"$f":"IFERROR(IF(OR(VLOOKUP(E14,Overview!$B$32:$D$87,3,FALSE)=\"Country not found\",VLOOKUP(E14,Overview!$B$32:$D$87,3,FALSE)=0),\"\",VLOOKUP(E14,Overview!$B$32:$D$87,3,FALSE)),\"\")","v":""},null,null,null,null,0,{"$f":"IF(K14=\"n/a\",0,K14*L14)","v":0},null,0,0,{"$f":"IF(N14=\"n/a\",0,N14*O14*P14)","v":0},{"$f":"IF(T14=\"Error\",0,ROUND(M14+Q14,2))","v":0},null,{"$f":"IF(OR(COUNTIF('Action  Plan'!$B$19:$B$218,B14)=0,COUNTIF(PartnerN°,E14)=0,H14=\"\",COUNTIF('Data sources'!$L$22:$L$24,I14)=0,J14=\"\",L14=0,O14=0,P14=0,M14+Q14=0),\"Error\",\"\")","v":"Error"}]

{"sheet":"4. Personnel  costs","index":5,"n_rows":14,"n_cols":25,"rows_kept":14,"cut":false,"hidden":false,"merged":[[1,1,1,21],[2,1,2,21],[3,1,3,2],[3,5,8,21],[4,1,4,2],[7,1,7,2],[8,1,8,2],[5,1,6,2],[5,3,6,3],[10,24,11,24],[10,22,11,22],[9,1,9,21],[10,3,11,3],[10,4,11,4],[10,5,11,5],[10,6,11,6],[10,1,11,1],[10,2,11,2],[10,7,10,11],[10,12,10,16],[10,17,10,21]]}
[]
[null,"4. PERSONNEL COSTS"]
[]
[null,null,null,"Total (EUR)"]
[null,"Salaries of personnel and fees for project management",null,{"$f":"SUM(L:L)","v":0}]
[null,"External professional services ",null,{"$f":"SUM(Q:Q)","v":0}]
[]
[null,"Fees, remuneration of artists, scientific personnel and technicians",null,{"$f":"SUM(V:V)","v":0}]
[null,null,null,{"$f":"SUM(D5:D8)","v":0}]
[]
[null,"Activity N°","Name of Activity\n(to encode in Action Plan sheet)","Work\nPackage\n(to encode in Action Plan  sheet)","Partner \nN°","Name of Partner\n(to encode in overview sheet)","Country\n(to encode in overview sheet)","Salaries",null,null,null,null,"External professional services ",null,null,null,null,"Fees, remuneration of artists, scientific personnel and technicians",null,null,null,null,"Total \n(EUR)",null,"Check\nData\nEncoding"]
[null,null,null,null,null,null,null,"Specification of the item","Explanation about nature, type of  the expense","Number of \ndays","Unit cost \nper day","Total\n(EUR)","Specification of the item","Explanation about nature, type of  the expense","Number of \ndays","Unit cost \nper day","Total\n(EUR)","Specification of the item","Explanation about nature, type of  the expense","Number of \ndays","Unit cost \nper day","Total\n(EUR)"]
[null,null,{"$f":"IFERROR(IF(VLOOKUP(B13,'Action  Plan'!$B$20:$C$219,2,FALSE)=0,\"\",VLOOKUP(B13,'Action  Plan'!$B$20:$C$219,2,FALSE)),\"\")","v":""},{"$f":"IFERROR(IF(VLOOKUP(B13,'Action  Plan'!$B$20:$D$219,3,FALSE)=0,\"\",VLOOKUP(B13,'Action  Plan'!$B$20:$D$219,3,FALSE)),\"\")","v":""},null,{"$f":"IFERROR(IF(VLOOKUP(E13,Overview!$B$32:$C$86,2,FALSE)=0,\"\",VLOOKUP(E13,Overview!$B$32:$C$86,2,FALSE)),\"\")","v":""},{"$f":"IFERROR(IF(OR(VLOOKUP(E13,Overview!$B$32:$D$87,3,FALSE)=\"Country not found\",VLOOKUP(E13,Overview!$B$32:$D$87,3,FALSE)=0),\"\",VLOOKUP(E13,Overview!$B$32:$D$87,3,FALSE)),\"\")","v":""},null,null,0,0,{"$f":"ROUND(J13*K13,2)","v":0},null,null,0,0,{"$f":"ROUND(O13*P13,2)","v":0},null,null,0,0,{"$f":"ROUND(T13*U13,2)","v":0},{"$f":"IF(Y13=\"Error\",0,ROUND(L13+Q13+V13,2))","v":0},null,{"$f":"IF(OR(COUNTIF('Action  Plan'!$B$19:$B$218,B13)=0,COUNTIF(PartnerN°,E13)=0,COUNTIF('Data sources'!$B$33:$B$37,H13)=0,I13=\"\",COUNTIF('Data sources'!$B$39:$B$46,M13)=0,N13=\"\",COUNTIF('Data sources'!$B$48:$B$55,'4. Personnel  costs'!R13)=0,S13=\"\",L13+Q13+V13=0),\"Error\",\"\")","v":"Error"}]
[null,null,{"$f":"IFERROR(IF(VLOOKUP(B14,'Action  Plan'!$B$20:$C$219,2,FALSE)=0,\"\",VLOOKUP(B14,'Action  Plan'!$B$20:$C$219,2,FALSE)),\"\")","v":""},{"$f":"IFERROR(IF(VLOOKUP(B14,'Action  Plan'!$B$20:$D$219,3,FALSE)=0,\"\",VLOOKUP(B14,'Action  Plan'!$B$20:$D$219,3,FALSE)),\"\")","v":""},null,{"$f":"IFERROR(IF(VLOOKUP(E14,Overview!$B$32:$C$86,2,FALSE)=0,\"\",VLOOKUP(E14,Overview!$B$32:$C$86,2,FALSE)),\"\")","v":""},{"$f":"IFERROR(IF(OR(VLOOKUP(E14,Overview!$B$32:$D$87,3,FALSE)=\"Country not found\",VLOOKUP(E14,Overview!$B$32:$D$87,3,FALSE)=0),\"\",VLOOKUP(E14,Overview!$B$32:$D$87,3,FALSE)),\"\")","v":""},null,null,0,0,{"$f":"ROUND(J14*K14,2)","v":0},null,null,0,0,{"$f":"ROUND(O14*P14,2)","v":0},null,null,0,0,{"$f":"ROUND(T14*U14,2)","v":0},{"$f":"IF(Y14=\"Error\",0,ROUND(L14+Q14+V14,2))","v":0},null,{"$f":"IF(OR(COUNTIF('Action  Plan'!$B$19:$B$218,B14)=0,COUNTIF(PartnerN°,E14)=0,COUNTIF('Data sources'!$B$33:$B$37,H14)=0,I14=\"\",COUNTIF('Data sources'!$B$39:$B$46,M14)=0,N14=\"\",COUNTIF('Data sources'!$B$48:$B$55,'4. Personnel  costs'!R14)=0,S14=\"\",L14+Q14+V14=0),\"Error\",\"\")","v":"Error"}]

{"sheet":"5. Indirect Costs","index":6,"n_rows":14,"n_cols":9,"rows_kept":14,"cut":false,"hidden":false,"merged":[[10,4,11,4],[10,5,11,5],[10,8,11,8],[0,1,0,8],[2,1,2,8],[3,1,8,1],[3,2,8,3],[10,6,11,6],[1,1,1,9],[3,4,8,9],[9,1,9,8],[10,1,11,1],[10,2,11,2],[10,3,11,3]]}
[]
[null,"5. INDIRECT COSTS"]
[]
[null,"Total (EUR)",{"$f":"SUM(G:G)","v":0},null,"The total of indirect costs cannot exceed 7% of the total direct costs [i.e. chapters (1) + (2) + (3) + (4)]\n'Premises and related expenses (e.g. office rent, insurance, electricity, water, cleaning, …) and office expenses and consumables (e.g. telephone / fax / internet, postage and mailing, photocopies, depreciation of equipment, …)"]
[]
[]
[]
[]
[]
[]
[null,"Partner \nN°","Name of Partner\n(to encode in overview sheet)","Country\n(to encode in overview sheet)","Nature, Type and specification of the  indirect costs","Amount\n(EUR)","Total\n(EUR)",null,"Check\nData\nEncoding"]
[]
[null,null,{"$f":"IFERROR(IF(VLOOKUP(B13,Overview!$B$32:$C$86,2,FALSE)=0,\"\",VLOOKUP(B13,Overview!$B$32:$C$86,2,FALSE)),\"\")","v":""},{"$f":"IFERROR(IF(OR(VLOOKUP(B13,Overview!$B$32:$D$87,3,FALSE)=\"Country not found\",VLOOKUP(B13,Overview!$B$32:$D$87,3,FALSE)=0),\"\",VLOOKUP(B13,Overview!$B$32:$D$87,3,FALSE)),\"\")","v":""},null,0,{"$f":"IF(I13=\"Error\",0,ROUND(F13,2))","v":0},null,{"$f":"IF(OR(COUNTIF(PartnerN°,B13)=0,E13=\"\",F13=0),\"Error\",\"\")","v":"Error"}]
[null,null,{"$f":"IFERROR(IF(VLOOKUP(B14,Overview!$B$32:$C$86,2,FALSE)=0,\"\",VLOOKUP(B14,Overview!$B$32:$C$86,2,FALSE)),\"\")","v":""},{"$f":"IFERROR(IF(OR(VLOOKUP(B14,Overview!$B$32:$D$87,3,FALSE)=\"Country not found\",VLOOKUP(B14,Overview!$B$32:$D$87,3,FALSE)=0),\"\",VLOOKUP(B14,Overview!$B$32:$D$87,3,FALSE)),\"\")","v":""},null,0,{"$f":"IF(I14=\"Error\",0,ROUND(F14,2))","v":0},null,{"$f":"IF(OR(COUNTIF(PartnerN°,B14)=0,E14=\"\",F14=0),\"Error\",\"\")","v":"Error"}]

{"sheet":"Co-financing  Income","index":7,"n_rows":14,"n_cols":11,"rows_kept":14,"cut":false,"hidden":false,"merged":[[10,10,11,10],[0,1,0,8],[2,1,2,8],[9,1,9,8],[1,1,1,8],[10,8,11,8],[10,5,11,5],[3,2,8,2],[3,1,8,1],[10,1,11,1],[10,2,11,2],[10,3,11,3],[10,6,11,6],[10,7,11,7],[10,4,11,4],[3,3,8,8]]}
[]
[null,"Information for the Co-financing and income of the project"]
[]
[null,"Total (EUR)",{"$f":"SUM(I:I)","v":0}]
[]
[]
[]
[]
[]
[]
[null,"Partner \nN°","Name of Partner\n(to encode in overview sheet)","Country\n(to encode in overview sheet)","Category of revenue","Source of Co-financing\nInsertt N/A for 'Distribution of the EU grant requested between partners'","Justification","Amount\n(EUR)","Total\n(EUR)",null,"Check\nData\nEncoding"]
[]
[null,null,{"$f":"IFERROR(IF(VLOOKUP(B13,PartnerN°Ref,2,FALSE)=0,\"\",VLOOKUP(B13,PartnerN°Ref,2,FALSE)),\"\")","v":""},{"$f":"IFERROR(IF(OR(VLOOKUP(B13,Overview!$B$32:$D$87,3,FALSE)=\"Country not found\",VLOOKUP(B13,Overview!$B$32:$D$87,3,FALSE)=0),\"\",VLOOKUP(B13,Overview!$B$32:$D$87,3,FALSE)),\"\")","v":""},null,null,null,0,{"$f":"IF(K13=\"Error\",0,ROUND(H13,2))","v":0},null,{"$f":"IF(OR(COUNTIF(PartnerN°,B13)=0,COUNTIF('Data sources'!$L$4:$L$8,E13)=0,F13=0,G13=\"\",H13=0),\"Error\",\"\")","v":"Error"}]
[null,null,{"$f":"IFERROR(IF(VLOOKUP(B14,PartnerN°Ref,2,FALSE)=0,\"\",VLOOKUP(B14,PartnerN°Ref,2,FALSE)),\"\")","v":""},{"$f":"IFERROR(IF(OR(VLOOKUP(B14,Overview!$B$32:$D$87,3,FALSE)=\"Country not found\",VLOOKUP(B14,Overview!$B$32:$D$87,3,FALSE)=0),\"\",VLOOKUP(B14,Overview!$B$32:$D$87,3,FALSE)),\"\")","v":""},null,null,null,0,{"$f":"IF(K14=\"Error\",0,ROUND(H14,2))","v":0},null,{"$f":"IF(OR(COUNTIF(PartnerN°,B14)=0,COUNTIF('Data sources'!$L$4:$L$8,E14)=0,F14=0,G14=\"\",H14=0),\"Error\",\"\")","v":"Error"}]

{"sheet":"Breakdown & Project Funding","index":8,"n_rows":276,"n_cols":9,"rows_kept":276,"cut":false,"hidden":false,"merged":[[74,1,74,2],[72,1,72,8],[73,1,73,7],[12,1,12,7],[0,1,0,7],[11,1,11,7],[10,1,10,7],[2,1,2,7],[1,1,1,7]]}
[]
[null,"Budget Breakdown by Work Package / Budget Chapters"]
[]
[null,"Work\nPackage","1. Costs linked to activities","2. Communication \nCosts","3. Travel & Subsistence\nCosts","4. Personnel \nCosts","5. Indirect costs","Total\n(EUR)"]
[null,"Preparatory Phase",{"$f":"SUMIF('1. Costs linked to activities'!D:D,B5,'1. Costs linked to activities'!K:K)","v":0},{"$f":"SUMIF('2. Communication Costs'!D:D,B5,'2. Communication Costs'!K:K)","v":0},{"$f":"SUMIF('3. Travel & Subsistence costs'!D:D,B5,'3. Travel & Subsistence costs'!R:R)","v":0},{"$f":"SUMIF('4. Personnel  costs'!D:D,B5,'4. Personnel  costs'!W:W)","v":0},null,{"$f":"SUM(C5:G5)","v":0}]
[null,"Management",{"$f":"SUMIF('1. Costs linked to activities'!D:D,B6,'1. Costs linked to activities'!K:K)","v":0},{"$f":"SUMIF('2. Communication Costs'!D:D,B6,'2. Communication Costs'!K:K)","v":0},{"$f":"SUMIF('3. Travel & Subsistence costs'!D:D,B6,'3. Travel & Subsistence costs'!R:R)","v":0},{"$f":"SUMIF('4. Personnel  costs'!D:D,B6,'4. Personnel  costs'!W:W)","v":0},null,{"$f":"SUM(C6:G6)","v":0}]
[null,"Communication and Dissemination",{"$f":"SUMIF('1. Costs linked to activities'!D:D,B7,'1. Costs linked to activities'!K:K)","v":0},{"$f":"SUMIF('2. Communication Costs'!D:D,B7,'2. Communication Costs'!K:K)","v":0},{"$f":"SUMIF('3. Travel & Subsistence costs'!D:D,B7,'3. Travel & Subsistence costs'!R:R)","v":0},{"$f":"SUMIF('4. Personnel  costs'!D:D,B7,'4. Personnel  costs'!W:W)","v":0},null,0]
[null,"Evaluation and Quality Assessment",{"$f":"SUMIF('1. Costs linked to activities'!D:D,B8,'1. Costs linked to activities'!K:K)","v":0},{"$f":"SUMIF('2. Communication Costs'!D:D,B8,'2. Communication Costs'!K:K)","v":0},{"$f":"SUMIF('3. Travel & Subsistence costs'!D:D,B8,'3. Travel & Subsistence costs'!R:R)","v":0},{"$f":"SUMIF('4. Personnel  costs'!D:D,B8,'4. Personnel  costs'!W:W)","v":0},null,0]
[null,"Implementation (cultural activities, publication, studies, research, etc.)",{"$f":"SUMIF('1. Costs linked to activities'!D:D,B9,'1. Costs linked to activities'!K:K)","v":0},{"$f":"SUMIF('2. Communication Costs'!D:D,B9,'2. Communication Costs'!K:K)","v":0},{"$f":"SUMIF('3. Travel & Subsistence costs'!D:D,B9,'3. Travel & Subsistence costs'!R:R)","v":0},{"$f":"SUMIF('4. Personnel  costs'!D:D,B9,'4. Personnel  costs'!W:W)","v":0},null,0]
[null,"TOTAL",{"$f":"SUM(C5:C9)","v":0},{"$f":"SUM(D5:D9)","v":0},{"$f":"SUM(E5:E9)","v":0},{"$f":"SUM(F5:F9)","v":0},{"$f":"+Overview!E24","v":0},0]
[]
[null,"Budget Breakdown by Partner / Work Package"]
[]
[null,"TOTAL",{"$f":"SUM(C16:C70)","v":0},{"$f":"SUM(D16:D70)","v":0},{"$f":"SUM(E16:E70)","v":0},{"$f":"SUM(F16:F70)","v":0},{"$f":"SUM(G16:G70)","v":0},{"$f":"SUM(C14:G14)","v":0}]
[null,"Partner\nN°",{"$f":"B5","v":"Preparatory Phase"},{"$f":"B6","v":"Management"},{"$f":"B7","v":"Communication and Dissemination"},{"$f":"B8","v":"Evaluation and Quality Assessment"},{"$f":"B9","v":"Implementation (cultural activities, publication, studies, research, etc.)"},"Total\n(EUR)"]
[null,"P1",{"$f":"SUMIFS('1. Costs linked to activities'!$K:$K,'1. Costs linked to activities'!$E:$E,$B16,'1. Costs linked to activities'!$D:$D,C$15)+SUMIFS('2. Communication Costs'!$K:$K,'2. Communication Costs'!$E:$E,'Breakdown & Project Funding'!$B16,'2. Communication Costs'!$D:$D,'Breakdown & Project Funding'!C$15)+SUMIFS('3. Travel & Subsistence costs'!$R:$R,'3. Travel & Subsistence costs'!$E:$E,'Breakdown & Project Funding'!$B16,'3. Travel & Subsistence costs'!$D:$D,'Breakdown & Project Funding'!C$15)+SUMIFS('4. Personnel  costs'!$W:$W,'4. Personnel  costs'!$E:$E,'Breakdown & Project Funding'!$B16,'4. Personnel  costs'!$D:$D,'Breakdown & Project Funding'!C$15)+SUMIFS('5. Indirect Costs'!$J:$J,'5. Indirect Costs'!$E:$E,'Breakdown & Project Funding'!$B16,'5. Indirect Costs'!$D:$D,'Breakdown & Project Funding'!C$15)","v":0},{"$f":"SUMIFS('1. Costs linked to activities'!$K:$K,'1. Costs linked to activities'!$E:$E,$B16,'1. Costs linked to activities'!$D:$D,D$15)+SUMIFS('2. Communication Costs'!$K:$K,'2. Communication Costs'!$E:$E,'Breakdown & Project Funding'!$B16,'2. Communication Costs'!$D:$D,'Breakdown & Project Funding'!D$15)+SUMIFS('3. Travel & Subsistence costs'!$R:$R,'3. Travel & Subsistence costs'!$E:$E,'Breakdown & Project Funding'!$B16,'3. Travel & Subsistence costs'!$D:$D,'Breakdown & Project Funding'!D$15)+SUMIFS('4. Personnel  costs'!$W:$W,'4. Personnel  costs'!$E:$E,'Breakdown & Project Funding'!$B16,'4. Personnel  costs'!$D:$D,'Breakdown & Project Funding'!D$15)+SUMIFS('5. Indirect Costs'!$J:$J,'5. Indirect Costs'!$E:$E,'Breakdown & Project Funding'!$B16,'5. Indirect Costs'!$D:$D,'Breakdown & Project Funding'!D$15)","v":0},{"$f":"SUMIFS('1. Costs linked to activities'!$K:$K,'1. Costs linked to activities'!$E:$E,$B16,'1. Costs linked to activities'!$D:$D,E$15)+SUMIFS('2. Communication Costs'!$K:$K,'2. Communication Costs'!$E:$E,'Breakdown & Project Funding'!$B16,'2. Communication Costs'!$D:$D,'Breakdown & Project Funding'!E$15)+SUMIFS('3. Travel & Subsistence costs'!$R:$R,'3. Travel & Subsistence costs'!$E:$E,'Breakdown & Project Funding'!$B16,'3. Travel & Subsistence costs'!$D:$D,'Breakdown & Project Funding'!E$15)+SUMIFS('4. Personnel  costs'!$W:$W,'4. Personnel  costs'!$E:$E,'Breakdown & Project Funding'!$B16,'4. Personnel  costs'!$D:$D,'Breakdown & Project Funding'!E$15)+SUMIFS('5. Indirect Costs'!$J:$J,'5. Indirect Costs'!$E:$E,'Breakdown & Project Funding'!$B16,'5. Indirect Costs'!$D:$D,'Breakdown & Project Funding'!E$15)","v":0},{"$f":"SUMIFS('1. Costs linked to activities'!$K:$K,'1. Costs linked to activities'!$E:$E,$B16,'1. Costs linked to activities'!$D:$D,F$15)+SUMIFS('2. Communication Costs'!$K:$K,'2. Communication Costs'!$E:$E,'Breakdown & Project Funding'!$B16,'2. Communication Costs'!$D:$D,'Breakdown & Project Funding'!F$15)+SUMIFS('3. Travel & Subsistence costs'!$R:$R,'3. Travel & Subsistence costs'!$E:$E,'Breakdown & Project Funding'!$B16,'3. Travel & Subsistence costs'!$D:$D,'Breakdown & Project Funding'!F$15)+SUMIFS('4. Personnel  costs'!$W:$W,'4. Personnel  costs'!$E:$E,'Breakdown & Project Funding'!$B16,'4. Personnel  costs'!$D:$D,'Breakdown & Project Funding'!F$15)+SUMIFS('5. Indirect Costs'!$J:$J,'5. Indirect Costs'!$E:$E,'Breakdown & Project Funding'!$B16,'5. Indirect Costs'!$D:$D,'Breakdown & Project Funding'!F$15)","v":0},{"$f":"SUMIFS('1. Costs linked to activities'!$K:$K,'1. Costs linked to activities'!$E:$E,$B16,'1. Costs linked to activities'!$D:$D,G$15)+SUMIFS('2. Communication Costs'!$K:$K,'2. Communication Costs'!$E:$E,'Breakdown & Project Funding'!$B16,'2. Communication Costs'!$D:$D,'Breakdown & Project Funding'!G$15)+SUMIFS('3. Travel & Subsistence costs'!$R:$R,'3. Travel & Subsistence costs'!$E:$E,'Breakdown & Project Funding'!$B16,'3. Travel & Subsistence costs'!$D:$D,'Breakdown & Project Funding'!G$15)+SUMIFS('4. Personnel  costs'!$W:$W,'4. Personnel  costs'!$E:$E,'Breakdown & Project Funding'!$B16,'4. Personnel  costs'!$D:$D,'Breakdown & Project Funding'!G$15)+SUMIFS('5. Indirect Costs'!$J:$J,'5. Indirect Costs'!$E:$E,'Breakdown & Project Funding'!$B16,'5. Indirect Costs'!$D:$D,'Breakdown & Project Funding'!G$15)","v":0},{"$f":"SUM(C16:G16)","v":0}]
[null,"P2",{"$f":"SUMIFS('1. Costs linked to activities'!$K:$K,'1. Costs linked to activities'!$E:$E,$B17,'1. Costs linked to activities'!$D:$D,C$15)+SUMIFS('2. Communication Costs'!$K:$K,'2. Communication Costs'!$E:$E,'Breakdown & Project Funding'!$B17,'2. Communication Costs'!$D:$D,'Breakdown & Project Funding'!C$15)+SUMIFS('3. Travel & Subsistence costs'!$R:$R,'3. Travel & Subsistence costs'!$E:$E,'Breakdown & Project Funding'!$B17,'3. Travel & Subsistence costs'!$D:$D,'Breakdown & Project Funding'!C$15)+SUMIFS('4. Personnel  costs'!$W:$W,'4. Personnel  costs'!$E:$E,'Breakdown & Project Funding'!$B17,'4. Personnel  costs'!$D:$D,'Breakdown & Project Funding'!C$15)+SUMIFS('5. Indirect Costs'!$J:$J,'5. Indirect Costs'!$E:$E,'Breakdown & Project Funding'!$B17,'5. Indirect Costs'!$D:$D,'Breakdown & Project Funding'!C$15)","v":0},{"$f":"SUMIFS('1. Costs linked to activities'!$K:$K,'1. Costs linked to activities'!$E:$E,$B17,'1. Costs linked to activities'!$D:$D,D$15)+SUMIFS('2. Communication Costs'!$K:$K,'2. Communication Costs'!$E:$E,'Breakdown & Project Funding'!$B17,'2. Communication Costs'!$D:$D,'Breakdown & Project Funding'!D$15)+SUMIFS('3. Travel & Subsistence costs'!$R:$R,'3. Travel & Subsistence costs'!$E:$E,'Breakdown & Project Funding'!$B17,'3. Travel & Subsistence costs'!$D:$D,'Breakdown & Project Funding'!D$15)+SUMIFS('4. Personnel  costs'!$W:$W,'4. Personnel  costs'!$E:$E,'Breakdown & Project Funding'!$B17,'4. Personnel  costs'!$D:$D,'Breakdown & Project Funding'!D$15)+SUMIFS('5. Indirect Costs'!$J:$J,'5. Indirect Costs'!$E:$E,'Breakdown & Project Funding'!$B17,'5. Indirect Costs'!$D:$D,'Breakdown & Project Funding'!D$15)","v":0},{"$f":"SUMIFS('1. Costs linked to activities'!$K:$K,'1. Costs linked to activities'!$E:$E,$B17,'1. Costs linked to activities'!$D:$D,E$15)+SUMIFS('2. Communication Costs'!$K:$K,'2. Communication Costs'!$E:$E,'Breakdown & Project Funding'!$B17,'2. Communication Costs'!$D:$D,'Breakdown & Project Funding'!E$15)+SUMIFS('3. Travel & Subsistence costs'!$R:$R,'3. Travel & Subsistence costs'!$E:$E,'Breakdown & Project Funding'!$B17,'3. Travel & Subsistence costs'!$D:$D,'Breakdown & Project Funding'!E$15)+SUMIFS('4. Personnel  costs'!$W:$W,'4. Personnel  costs'!$E:$E,'Breakdown & Project Funding'!$B17,'4. Personnel  costs'!$D:$D,'Breakdown & Project Funding'!E$15)+SUMIFS('5. Indirect Costs'!$J:$J,'5. Indirect Costs'!$E:$E,'Breakdown & Project Funding'!$B17,'5. Indirect Costs'!$D:$D,'Breakdown & Project Funding'!E$15)","v":0},{"$f":"SUMIFS('1. Costs linked to activities'!$K:$K,'1. Costs linked to activities'!$E:$E,$B17,'1. Costs linked to activities'!$D:$D,F$15)+SUMIFS('2. Communication Costs'!$K:$K,'2. Communication Costs'!$E:$E,'Breakdown & Project Funding'!$B17,'2. Communication Costs'!$D:$D,'Breakdown & Project Funding'!F$15)+SUMIFS('3. Travel & Subsistence costs'!$R:$R,'3. Travel & Subsistence costs'!$E:$E,'Breakdown & Project Funding'!$B17,'3. Travel & Subsistence costs'!$D:$D,'Breakdown & Project Funding'!F$15)+SUMIFS('4. Personnel  costs'!$W:$W,'4. Personnel  costs'!$E:$E,'Breakdown & Project Funding'!$B17,'4. Personnel  costs'!$D:$D,'Breakdown & Project Funding'!F$15)+SUMIFS('5. Indirect Costs'!$J:$J,'5. Indirect Costs'!$E:$E,'Breakdown & Project Funding'!$B17,'5. Indirect Costs'!$D:$D,'Breakdown & Project Funding'!F$15)","v":0},{"$f":"SUMIFS('1. Costs linked to activities'!$K:$K,'1. Costs linked to activities'!$E:$E,$B17,'1. Costs linked to activities'!$D:$D,G$15)+SUMIFS('2. Communication Costs'!$K:$K,'2. Communication Costs'!$E:$E,'Breakdown & Project Funding'!$B17,'2. Communication Costs'!$D:$D,'Breakdown & Project Funding'!G$15)+SUMIFS('3. Travel & Subsistence costs'!$R:$R,'3. Travel & Subsistence costs'!$E:$E,'Breakdown & Project Funding'!$B17,'3. Travel & Subsistence costs'!$D:$D,'Breakdown & Project Funding'!G$15)+SUMIFS('4. Personnel  costs'!$W:$W,'4. Personnel  costs'!$E:$E,'Breakdown & Project Funding'!$B17,'4. Personnel  costs'!$D:$D,'Breakdown & Project Funding'!G$15)+SUMIFS('5. Indirect Costs'!$J:$J,'5. Indirect Costs'!$E:$E,'Breakdown & Project Funding'!$B17,'5. Indirect Costs'!$D:$D,'Breakdown & Project Funding'!G$15)","v":0},{"$f":"SUM(C17:G17)","v":0}]
[null,"P3",{"$f":"SUMIFS('1. Costs linked to activities'!$K:$K,'1. Costs linked to activities'!$E:$E,$B18,'1. Costs linked to activities'!$D:$D,C$15)+SUMIFS('2. Communication Costs'!$K:$K,'2. Communication Costs'!$E:$E,'Breakdown & Project Funding'!$B18,'2. Communication Costs'!$D:$D,'Breakdown & Project Funding'!C$15)+SUMIFS('3. Travel & Subsistence costs'!$R:$R,'3. Travel & Subsistence costs'!$E:$E,'Breakdown & Project Funding'!$B18,'3. Travel & Subsistence costs'!$D:$D,'Breakdown & Project Funding'!C$15)+SUMIFS('4. Personnel  costs'!$W:$W,'4. Personnel  costs'!$E:$E,'Breakdown & Project Funding'!$B18,'4. Personnel  costs'!$D:$D,'Breakdown & Project Funding'!C$15)+SUMIFS('5. Indirect Costs'!$J:$J,'5. Indirect Costs'!$E:$E,'Breakdown & Project Funding'!$B18,'5. Indirect Costs'!$D:$D,'Breakdown & Project Funding'!C$15)","v":0},{"$f":"SUMIFS('1. Costs linked to activities'!$K:$K,'1. Costs linked to activities'!$E:$E,$B18,'1. Costs linked to activities'!$D:$D,D$15)+SUMIFS('2. Communication Costs'!$K:$K,'2. Communication Costs'!$E:$E,'Breakdown & Project Funding'!$B18,'2. Communication Costs'!$D:$D,'Breakdown & Project Funding'!D$15)+SUMIFS('3. Travel & Subsistence costs'!$R:$R,'3. Travel & Subsistence costs'!$E:$E,'Breakdown & Project Funding'!$B18,'3. Travel & Subsistence costs'!$D:$D,'Breakdown & Project Funding'!D$15)+SUMIFS('4. Personnel  costs'!$W:$W,'4. Personnel  costs'!$E:$E,'Breakdown & Project Funding'!$B18,'4. Personnel  costs'!$D:$D,'Breakdown & Project Funding'!D$15)+SUMIFS('5. Indirect Costs'!$J:$J,'5. Indirect Costs'!$E:$E,'Breakdown & Project Funding'!$B18,'5. Indirect Costs'!$D:$D,'Breakdown & Project Funding'!D$15)","v":0},{"$f":"SUMIFS('1. Costs linked to activities'!$K:$K,'1. Costs linked to activities'!$E:$E,$B18,'1. Costs linked to activities'!$D:$D,E$15)+SUMIFS('2. Communication Costs'!$K:$K,'2. Communication Costs'!$E:$E,'Breakdown & Project Funding'!$B18,'2. Communication Costs'!$D:$D,'Breakdown & Project Funding'!E$15)+SUMIFS('3. Travel & Subsistence costs'!$R:$R,'3. Travel & Subsistence costs'!$E:$E,'Breakdown & Project Funding'!$B18,'3. Travel & Subsistence costs'!$D:$D,'Breakdown & Project Funding'!E$15)+SUMIFS('4. Personnel  costs'!$W:$W,'4. Personnel  costs'!$E:$E,'Breakdown & Project Funding'!$B18,'4. Personnel  costs'!$D:$D,'Breakdown & Project Funding'!E$15)+SUMIFS('5. Indirect Costs'!$J:$J,'5. Indirect Costs'!$E:$E,'Breakdown & Project Funding'!$B18,'5. Indirect Costs'!$D:$D,'Breakdown & Project Funding'!E$15)","v":0},{"$f":"SUMIFS('1. Costs linked to activities'!$K:$K,'1. Costs linked to activities'!$E:$E,$B18,'1. Costs linked to activities'!$D:$D,F$15)+SUMIFS('2. Communication Costs'!$K:$K,'2. Communication Costs'!$E:$E,'Breakdown & Project Funding'!$B18,'2. Communication Costs'!$D:$D,'Breakdown & Project Funding'!F$15)+SUMIFS('3. Travel & Subsistence costs'!$R:$R,'3. Travel & Subsistence costs'!$E:$E,'Breakdown & Project Funding'!$B18,'3. Travel & Subsistence costs'!$D:$D,'Breakdown & Project Funding'!F$15)+SUMIFS('4. Personnel  costs'!$W:$W,'4. Personnel  costs'!$E:$E,'Breakdown & Project Funding'!$B18,'4. Personnel  costs'!$D:$D,'Breakdown & Project Funding'!F$15)+SUMIFS('5. Indirect Costs'!$J:$J,'5. Indirect Costs'!$E:$E,'Breakdown & Project Funding'!$B18,'5. Indirect Costs'!$D:$D,'Breakdown & Project Funding'!F$15)","v":0},{"$f":"SUMIFS('1. Costs linked to activities'!$K:$K,'1. Costs linked to activities'!$E:$E,$B18,'1. Costs linked to activities'!$D:$D,G$15)+SUMIFS('2. Communication Costs'!$K:$K,'2. Communication Costs'!$E:$E,'Breakdown & Project Funding'!$B18,'2. Communication Costs'!$D:$D,'Breakdown & Project Funding'!G$15)+SUMIFS('3. Travel & Subsistence costs'!$R:$R,'3. Travel & Subsistence costs'!$E:$E,'Breakdown & Project Funding'!$B18,'3. Travel & Subsistence costs'!$D:$D,'Breakdown & Project Funding'!G$15)+SUMIFS('4. Personnel  costs'!$W:$W,'4. Personnel  costs'!$E:$E,'Breakdown & Project Funding'!$B18,'4. Personnel  costs'!$D:$D,'Breakdown & Project Funding'!G$15)+SUMIFS('5. Indirect Costs'!$J:$J,'5. Indirect Costs'!$E:$E,'Breakdown & Project Funding'!$B18,'5. Indirect Costs'!$D:$D,'Breakdown & Project Funding'!G$15)","v":0},{"$f":"SUM(C18:G18)","v":0}]
[null,"P4",{"$f":"SUMIFS('1. Costs linked to activities'!$K:$K,'1. Costs linked to activities'!$E:$E,$B19,'1. Costs linked to activities'!$D:$D,C$15)+SUMIFS('2. Communication Costs'!$K:$K,'2. Communication Costs'!$E:$E,'Breakdown & Project Funding'!$B19,'2. Communication Costs'!$D:$D,'Breakdown & Project Funding'!C$15)+SUMIFS('3. Travel & Subsistence costs'!$R:$R,'3. Travel & Subsistence costs'!$E:$E,'Breakdown & Project Funding'!$B19,'3. Travel & Subsistence costs'!$D:$D,'Breakdown & Project Funding'!C$15)+SUMIFS('4. Personnel  costs'!$W:$W,'4. Personnel  costs'!$E:$E,'Breakdown & Project Funding'!$B19,'4. Personnel  costs'!$D:$D,'Breakdown & Project Funding'!C$15)+SUMIFS('5. Indirect Costs'!$J:$J,'5. Indirect Costs'!$E:$E,'Breakdown & Project Funding'!$B19,'5. Indirect Costs'!$D:$D,'Breakdown & Project Funding'!C$15)","v":0},{"$f":"SUMIFS('1. Costs linked to activities'!$K:$K,'1. Costs linked to activities'!$E:$E,$B19,'1. Costs linked to activities'!$D:$D,D$15)+SUMIFS('2. Communication Costs'!$K:$K,'2. Communication Costs'!$E:$E,'Breakdown & Project Funding'!$B19,'2. Communication Costs'!$D:$D,'Breakdown & Project Funding'!D$15)+SUMIFS('3. Travel & Subsistence costs'!$R:$R,'3. Travel & Subsistence costs'!$E:$E,'Breakdown & Project Funding'!$B19,'3. Travel & Subsistence costs'!$D:$D,'Breakdown & Project Funding'!D$15)+SUMIFS('4. Personnel  costs'!$W:$W,'4. Personnel  costs'!$E:$E,'Breakdown & Project Funding'!$B19,'4. Personnel  costs'!$D:$D,'Breakdown & Project Funding'!D$15)+SUMIFS('5. Indirect Costs'!$J:$J,'5. Indirect Costs'!$E:$E,'Breakdown & Project Funding'!$B19,'5. Indirect Costs'!$D:$D,'Breakdown & Project Funding'!D$15)","v":0},{"$f":"SUMIFS('1. Costs linked to activities'!$K:$K,'1. Costs linked to activities'!$E:$E,$B19,'1. Costs linked to activities'!$D:$D,E$15)+SUMIFS('2. Communication Costs'!$K:$K,'2. Communication Costs'!$E:$E,'Breakdown & Project Funding'!$B19,'2. Communication Costs'!$D:$D,'Breakdown & Project Funding'!E$15)+SUMIFS('3. Travel & Subsistence costs'!$R:$R,'3. Travel & Subsistence costs'!$E:$E,'Breakdown & Project Funding'!$B19,'3. Travel & Subsistence costs'!$D:$D,'Breakdown & Project Funding'!E$15)+SUMIFS('4. Personnel  costs'!$W:$W,'4. Personnel  costs'!$E:$E,'Breakdown & Project Funding'!$B19,'4. Personnel  costs'!$D:$D,'Breakdown & Project Funding'!E$15)+SUMIFS('5. Indirect Costs'!$J:$J,'5. Indirect Costs'!$E:$E,'Breakdown & Project Funding'!$B19,'5. Indirect Costs'!$D:$D,'Breakdown & Project Funding'!E$15)","v":0},{"$f":"SUMIFS('1. Costs linked to activities'!$K:$K,'1. Costs linked to activities'!$E:$E,$B19,'1. Costs linked to activities'!$D:$D,F$15)+SUMIFS('2. Communication Costs'!$K:$K,'2. Communication Costs'!$E:$E,'Breakdown & Project Funding'!$B19,'2. Communication Costs'!$D:$D,'Breakdown & Project Funding'!F$15)+SUMIFS('3. Travel & Subsistence costs'!$R:$R,'3. Travel & Subsistence costs'!$E:$E,'Breakdown & Project Funding'!$B19,'3. Travel & Subsistence costs'!$D:$D,'Breakdown & Project Funding'!F$15)+SUMIFS('4. Personnel  costs'!$W:$W,'4. Personnel  costs'!$E:$E,'Breakdown & Project Funding'!$B19,'4. Personnel  costs'!$D:$D,'Breakdown & Project Funding'!F$15)+SUMIFS('5. Indirect Costs'!$J:$J,'5. Indirect Costs'!$E:$E,'Breakdown & Project Funding'!$B19,'5. Indirect Costs'!$D:$D,'Breakdown & Project Funding'!F$15)","v":0},{"$f":"SUMIFS('1. Costs linked to activities'!$K:$K,'1. Costs linked to activities'!$E:$E,$B19,'1. Costs linked to activities'!$D:$D,G$15)+SUMIFS('2. Communication Costs'!$K:$K,'2. Communication Costs'!$E:$E,'Breakdown & Project Funding'!$B19,'2. Communication Costs'!$D:$D,'Breakdown & Project Funding'!G$15)+SUMIFS('3. Travel & Subsistence costs'!$R:$R,'3. Travel & Subsistence costs'!$E:$E,'Breakdown & Project Funding'!$B19,'3. Travel & Subsistence costs'!$D:$D,'Breakdown & Project Funding'!G$15)+SUMIFS('4. Personnel  costs'!$W:$W,'4. Personnel  costs'!$E:$E,'Breakdown & Project Funding'!$B19,'4. Personnel  costs'!$D:$D,'Breakdown & Project Funding'!G$15)+SUMIFS('5. Indirect Costs'!$J:$J,'5. Indirect Costs'!$E:$E,'Breakdown & Project Funding'!$B19,'5. Indirect Costs'!$D:$D,'Breakdown & Project Funding'!G$15)","v":0},{"$f":"SUM(C19:G19)","v":0}]
[null,"P5",{"$f":"SUMIFS('1. Costs linked to activities'!$K:$K,'1. Costs linked to activities'!$E:$E,$B20,'1. Costs linked to activities'!$D:$D,C$15)+SUMIFS('2. Communication Costs'!$K:$K,'2. Communication Costs'!$E:$E,'Breakdown & Project Funding'!$B20,'2. Communication Costs'!$D:$D,'Breakdown & Project Funding'!C$15)+SUMIFS('3. Travel & Subsistence costs'!$R:$R,'3. Travel & Subsistence costs'!$E:$E,'Breakdown & Project Funding'!$B20,'3. Travel & Subsistence costs'!$D:$D,'Breakdown & Project Funding'!C$15)+SUMIFS('4. Personnel  costs'!$W:$W,'4. Personnel  costs'!$E:$E,'Breakdown & Project Funding'!$B20,'4. Personnel  costs'!$D:$D,'Breakdown & Project Funding'!C$15)+SUMIFS('5. Indirect Costs'!$J:$J,'5. Indirect Costs'!$E:$E,'Breakdown & Project Funding'!$B20,'5. Indirect Costs'!$D:$D,'Breakdown & Project Funding'!C$15)","v":0},{"$f":"SUMIFS('1. Costs linked to activities'!$K:$K,'1. Costs linked to activities'!$E:$E,$B20,'1. Costs linked to activities'!$D:$D,D$15)+SUMIFS('2. Communication Costs'!$K:$K,'2. Communication Costs'!$E:$E,'Breakdown & Project Funding'!$B20,'2. Communication Costs'!$D:$D,'Breakdown & Project Funding'!D$15)+SUMIFS('3. Travel & Subsistence costs'!$R:$R,'3. Travel & Subsistence costs'!$E:$E,'Breakdown & Project Funding'!$B20,'3. Travel & Subsistence costs'!$D:$D,'Breakdown & Project Funding'!D$15)+SUMIFS('4. Personnel  costs'!$W:$W,'4. Personnel  costs'!$E:$E,'Breakdown & Project Funding'!$B20,'4. Personnel  costs'!$D:$D,'Breakdown & Project Funding'!D$15)+SUMIFS('5. Indirect Costs'!$J:$J,'5. Indirect Costs'!$E:$E,'Breakdown & Project Funding'!$B20,'5. Indirect Costs'!$D:$D,'Breakdown & Project Funding'!D$15)","v":0},{"$f":"SUMIFS('1. Costs linked to activities'!$K:$K,'1. Costs linked to activities'!$E:$E,$B20,'1. Costs linked to activities'!$D:$D,E$15)+SUMIFS('2. Communication Costs'!$K:$K,'2. Communication Costs'!$E:$E,'Breakdown & Project Funding'!$B20,'2. Communication Costs'!$D:$D,'Breakdown & Project Funding'!E$15)+SUMIFS('3. Travel & Subsistence costs'!$R:$R,'3. Travel & Subsistence costs'!$E:$E,'Breakdown & Project Funding'!$B20,'3. Travel & Subsistence costs'!$D:$D,'Breakdown & Project Funding'!E$15)+SUMIFS('4. Personnel  costs'!$W:$W,'4. Personnel  costs'!$E:$E,'Breakdown & Project Funding'!$B20,'4. Personnel  costs'!$D:$D,'Breakdown & Project Funding'!E$15)+SUMIFS('5. Indirect Costs'!$J:$J,'5. Indirect Costs'!$E:$E,'Breakdown & Project Funding'!$B20,'5. Indirect Costs'!$D:$D,'Breakdown & Project Funding'!E$15)","v":0},{"$f":"SUMIFS('1. Costs linked to activities'!$K:$K,'1. Costs linked to activities'!$E:$E,$B20,'1. Costs linked to activities'!$D:$D,F$15)+SUMIFS('2. Communication Costs'!$K:$K,'2. Communication Costs'!$E:$E,'Breakdown & Project Funding'!$B20,'2. Communication Costs'!$D:$D,'Breakdown & Project Funding'!F$15)+SUMIFS('3. Travel & Subsistence costs'!$R:$R,'3. Travel & Subsistence costs'!$E:$E,'Breakdown & Project Funding'!$B20,'3. Travel & Subsistence costs'!$D:$D,'Breakdown & Project Funding'!F$15)+SUMIFS('4. Personnel  costs'!$W:$W,'4. Personnel  costs'!$E:$E,'Breakdown & Project Funding'!$B20,'4. Personnel  costs'!$D:$D,'Breakdown & Project Funding'!F$15)+SUMIFS('5. Indirect Costs'!$J:$J,'5. Indirect Costs'!$E:$E,'Breakdown & Project Funding'!$B20,'5. Indirect Costs'!$D:$D,'Breakdown & Project Funding'!F$15)","v":0},{"$f":"SUMIFS('1. Costs linked to activities'!$K:$K,'1. Costs linked to activities'!$E:$E,$B20,'1. Costs linked to activities'!$D:$D,G$15)+SUMIFS('2. Communication Costs'!$K:$K,'2. Communication Costs'!$E:$E,'Breakdown & Project Funding'!$B20,'2. Communication Costs'!$D:$D,'Breakdown & Project Funding'!G$15)+SUMIFS('3. Travel & Subsistence costs'!$R:$R,'3. Travel & Subsistence costs'!$E:$E,'Breakdown & Project Funding'!$B20,'3. Travel & Subsistence costs'!$D:$D,'Breakdown & Project Funding'!G$15)+SUMIFS('4. Personnel  costs'!$W:$W,'4. Personnel  costs'!$E:$E,'Breakdown & Project Funding'!$B20,'4. Personnel  costs'!$D:$D,'Breakdown & Project Funding'!G$15)+SUMIFS('5. Indirect Costs'!$J:$J,'5. Indirect Costs'!$E:$E,'Breakdown & Project Funding'!$B20,'5. Indirect Costs'!$D:$D,'Breakdown & Project Funding'!G$15)","v":0},0]
[null,"P6",{"$f":"SUMIFS('1. Costs linked to activities'!$K:$K,'1. Costs linked to activities'!$E:$E,$B21,'1. Costs linked to activities'!$D:$D,C$15)+SUMIFS('2. Communication Costs'!$K:$K,'2. Communication Costs'!$E:$E,'Breakdown & Project Funding'!$B21,'2. Communication Costs'!$D:$D,'Breakdown & Project Funding'!C$15)+SUMIFS('3. Travel & Subsistence costs'!$R:$R,'3. Travel & Subsistence costs'!$E:$E,'Breakdown & Project Funding'!$B21,'3. Travel & Subsistence costs'!$D:$D,'Breakdown & Project Funding'!C$15)+SUMIFS('4. Personnel  costs'!$W:$W,'4. Personnel  costs'!$E:$E,'Breakdown & Project Funding'!$B21,'4. Personnel  costs'!$D:$D,'Breakdown & Project Funding'!C$15)+SUMIFS('5. Indirect Costs'!$J:$J,'5. Indirect Costs'!$E:$E,'Breakdown & Project Funding'!$B21,'5. Indirect Costs'!$D:$D,'Breakdown & Project Funding'!C$15)","v":0},{"$f":"SUMIFS('1. Costs linked to activities'!$K:$K,'1. Costs linked to activities'!$E:$E,$B21,'1. Costs linked to activities'!$D:$D,D$15)+SUMIFS('2. Communication Costs'!$K:$K,'2. Communication Costs'!$E:$E,'Breakdown & Project Funding'!$B21,'2. Communication Costs'!$D:$D,'Breakdown & Project Funding'!D$15)+SUMIFS('3. Travel & Subsistence costs'!$R:$R,'3. Travel & Subsistence costs'!$E:$E,'Breakdown & Project Funding'!$B21,'3. Travel & Subsistence costs'!$D:$D,'Breakdown & Project Funding'!D$15)+SUMIFS('4. Personnel  costs'!$W:$W,'4. Personnel  costs'!$E:$E,'Breakdown & Project Funding'!$B21,'4. Personnel  costs'!$D:$D,'Breakdown & Project Funding'!D$15)+SUMIFS('5. Indirect Costs'!$J:$J,'5. Indirect Costs'!$E:$E,'Breakdown & Project Funding'!$B21,'5. Indirect Costs'!$D:$D,'Breakdown & Project Funding'!D$15)","v":0},{"$f":"SUMIFS('1. Costs linked to activities'!$K:$K,'1. Costs linked to activities'!$E:$E,$B21,'1. Costs linked to activities'!$D:$D,E$15)+SUMIFS('2. Communication Costs'!$K:$K,'2. Communication Costs'!$E:$E,'Breakdown & Project Funding'!$B21,'2. Communication Costs'!$D:$D,'Breakdown & Project Funding'!E$15)+SUMIFS('3. Travel & Subsistence costs'!$R:$R,'3. Travel & Subsistence costs'!$E:$E,'Breakdown & Project Funding'!$B21,'3. Travel & Subsistence costs'!$D:$D,'Breakdown & Project Funding'!E$15)+SUMIFS('4. Personnel  costs'!$W:$W,'4. Personnel  costs'!$E:$E,'Breakdown & Project Funding'!$B21,'4. Personnel  costs'!$D:$D,'Breakdown & Project Funding'!E$15)+SUMIFS('5. Indirect Costs'!$J:$J,'5. Indirect Costs'!$E:$E,'Breakdown & Project Funding'!$B21,'5. Indirect Costs'!$D:$D,'Breakdown & Project Funding'!E$15)","v":0},{"$f":"SUMIFS('1. Costs linked to activities'!$K:$K,'1. Costs linked to activities'!$E:$E,$B21,'1. Costs linked to activities'!$D:$D,F$15)+SUMIFS('2. Communication Costs'!$K:$K,'2. Communication Costs'!$E:$E,'Breakdown & Project Funding'!$B21,'2. Communication Costs'!$D:$D,'Breakdown & Project Funding'!F$15)+SUMIFS('3. Travel & Subsistence costs'!$R:$R,'3. Travel & Subsistence costs'!$E:$E,'Breakdown & Project Funding'!$B21,'3. Travel & Subsistence costs'!$D:$D,'Breakdown & Project Funding'!F$15)+SUMIFS('4. Personnel  costs'!$W:$W,'4. Personnel  costs'!$E:$E,'Breakdown & Project Funding'!$B21,'4. Personnel  costs'!$D:$D,'Breakdown & Project Funding'!F$15)+SUMIFS('5. Indirect Costs'!$J:$J,'5. Indirect Costs'!$E:$E,'Breakdown & Project Funding'!$B21,'5. Indirect Costs'!$D:$D,'Breakdown & Project Funding'!F$15)","v":0},{"$f":"SUMIFS('1. Costs linked to activities'!$K:$K,'1. Costs linked to activities'!$E:$E,$B21,'1. Costs linked to activities'!$D:$D,G$15)+SUMIFS('2. Communication Costs'!$K:$K,'2. Communication Costs'!$E:$E,'Breakdown & Project Funding'!$B21,'2. Communication Costs'!$D:$D,'Breakdown & Project Funding'!G$15)+SUMIFS('3. Travel & Subsistence costs'!$R:$R,'3. Travel & Subsistence costs'!$E:$E,'Breakdown & Project Funding'!$B21,'3. Travel & Subsistence costs'!$D:$D,'Breakdown & Project Funding'!G$15)+SUMIFS('4. Personnel  costs'!$W:$W,'4. Personnel  costs'!$E:$E,'Breakdown & Project Funding'!$B21,'4. Personnel  costs'!$D:$D,'Breakdown & Project Funding'!G$15)+SUMIFS('5. Indirect Costs'!$J:$J,'5. Indirect Costs'!$E:$E,'Breakdown & Project Funding'!$B21,'5. Indirect Costs'!$D:$D,'Breakdown & Project Funding'!G$15)","v":0},0]
[null,"P7",{"$f":"SUMIFS('1. Costs linked to activities'!$K:$K,'1. Costs linked to activities'!$E:$E,$B22,'1. Costs linked to activities'!$D:$D,C$15)+SUMIFS('2. Communication Costs'!$K:$K,'2. Communication Costs'!$E:$E,'Breakdown & Project Funding'!$B22,'2. Communication Costs'!$D:$D,'Breakdown & Project Funding'!C$15)+SUMIFS('3. Travel & Subsistence costs'!$R:$R,'3. Travel & Subsistence costs'!$E:$E,'Breakdown & Project Funding'!$B22,'3. Travel & Subsistence costs'!$D:$D,'Breakdown & Project Funding'!C$15)+SUMIFS('4. Personnel  costs'!$W:$W,'4. Personnel  costs'!$E:$E,'Breakdown & Project Funding'!$B22,'4. Personnel  costs'!$D:$D,'Breakdown & Project Funding'!C$15)+SUMIFS('5. Indirect Costs'!$J:$J,'5. Indirect Costs'!$E:$E,'Breakdown & Project Funding'!$B22,'5. Indirect Costs'!$D:$D,'Breakdown & Project Funding'!C$15)","v":0},{"$f":"SUMIFS('1. Costs linked to activities'!$K:$K,'1. Costs linked to activities'!$E:$E,$B22,'1. Costs linked to activities'!$D:$D,D$15)+SUMIFS('2. Communication Costs'!$K:$K,'2. Communication Costs'!$E:$E,'Breakdown & Project Funding'!$B22,'2. Communication Costs'!$D:$D,'Breakdown & Project Funding'!D$15)+SUMIFS('3. Travel & Subsistence costs'!$R:$R,'3. Travel & Subsistence costs'!$E:$E,'Breakdown & Project Funding'!$B22,'3. Travel & Subsistence costs'!$D:$D,'Breakdown & Project Funding'!D$15)+SUMIFS('4. Personnel  costs'!$W:$W,'4. Personnel  costs'!$E:$E,'Breakdown & Project Funding'!$B22,'4. Personnel  costs'!$D:$D,'Breakdown & Project Funding'!D$15)+SUMIFS('5. Indirect Costs'!$J:$J,'5. Indirect Costs'!$E:$E,'Breakdown & Project Funding'!$B22,'5. Indirect Costs'!$D:$D,'Breakdown & Project Funding'!D$15)","v":0},{"$f":"SUMIFS('1. Costs linked to activities'!$K:$K,'1. Costs linked to activities'!$E:$E,$B22,'1. Costs linked to activities'!$D:$D,E$15)+SUMIFS('2. Communication Costs'!$K:$K,'2. Communication Costs'!$E:$E,'Breakdown & Project Funding'!$B22,'2. Communication Costs'!$D:$D,'Breakdown & Project Funding'!E$15)+SUMIFS('3. Travel & Subsistence costs'!$R:$R,'3. Travel & Subsistence costs'!$E:$E,'Breakdown & Project Funding'!$B22,'3. Travel & Subsistence costs'!$D:$D,'Breakdown & Project Funding'!E$15)+SUMIFS('4. Personnel  costs'!$W:$W,'4. Personnel  costs'!$E:$E,'Breakdown & Project Funding'!$B22,'4. Personnel  costs'!$D:$D,'Breakdown & Project Funding'!E$15)+SUMIFS('5. Indirect Costs'!$J:$J,'5. Indirect Costs'!$E:$E,'Breakdown & Project Funding'!$B22,'5. Indirect Costs'!$D:$D,'Breakdown & Project Funding'!E$15)","v":0},{"$f":"SUMIFS('1. Costs linked to activities'!$K:$K,'1. Costs linked to activities'!$E:$E,$B22,'1. Costs linked to activities'!$D:$D,F$15)+SUMIFS('2. Communication Costs'!$K:$K,'2. Communication Costs'!$E:$E,'Breakdown & Project Funding'!$B22,'2. Communication Costs'!$D:$D,'Breakdown & Project Funding'!F$15)+SUMIFS('3. Travel & Subsistence costs'!$R:$R,'3. Travel & Subsistence costs'!$E:$E,'Breakdown & Project Funding'!$B22,'3. Travel & Subsistence costs'!$D:$D,'Breakdown & Project Funding'!F$15)+SUMIFS('4. Personnel  costs'!$W:$W,'4. Personnel  costs'!$E:$E,'Breakdown & Project Funding'!$B22,'4. Personnel  costs'!$D:$D,'Breakdown & Project Funding'!F$15)+SUMIFS('5. Indirect Costs'!$J:$J,'5. Indirect Costs'!$E:$E,'Breakdown & Project Funding'!$B22,'5. Indirect Costs'!$D:$D,'Breakdown & Project Funding'!F$15)","v":0},{"$f":"SUMIFS('1. Costs linked to activities'!$K:$K,'1. Costs linked to activities'!$E:$E,$B22,'1. Costs linked to activities'!$D:$D,G$15)+SUMIFS('2. Communication Costs'!$K:$K,'2. Communication Costs'!$E:$E,'Breakdown & Project Funding'!$B22,'2. Communication Costs'!$D:$D,'Breakdown & Project Funding'!G$15)+SUMIFS('3. Travel & Subsistence costs'!$R:$R,'3. Travel & Subsistence costs'!$E:$E,'Breakdown & Project Funding'!$B22,'3. Travel & Subsistence costs'!$D:$D,'Breakdown & Project Funding'!G$15)+SUMIFS('4. Personnel  costs'!$W:$W,'4. Personnel  costs'!$E:$E,'Breakdown & Project Funding'!$B22,'4. Personnel  costs'!$D:$D,'Breakdown & Project Funding'!G$15)+SUMIFS('5. Indirect Costs'!$J:$J,'5. Indirect Costs'!$E:$E,'Breakdown & Project Funding'!$B22,'5. Indirect Costs'!$D:$D,'Breakdown & Project Funding'!G$15)","v":0},0]
[null,"P8",{"$f":"SUMIFS('1. Costs linked to activities'!$K:$K,'1. Costs linked to activities'!$E:$E,$B23,'1. Costs linked to activities'!$D:$D,C$15)+SUMIFS('2. Communication Costs'!$K:$K,'2. Communication Costs'!$E:$E,'Breakdown & Project Funding'!$B23,'2. Communication Costs'!$D:$D,'Breakdown & Project Funding'!C$15)+SUMIFS('3. Travel & Subsistence costs'!$R:$R,'3. Travel & Subsistence costs'!$E:$E,'Breakdown & Project Funding'!$B23,'3. Travel & Subsistence costs'!$D:$D,'Breakdown & Project Funding'!C$15)+SUMIFS('4. Personnel  costs'!$W:$W,'4. Personnel  costs'!$E:$E,'Breakdown & Project Funding'!$B23,'4. Personnel  costs'!$D:$D,'Breakdown & Project Funding'!C$15)+SUMIFS('5. Indirect Costs'!$J:$J,'5. Indirect Costs'!$E:$E,'Breakdown & Project Funding'!$B23,'5. Indirect Costs'!$D:$D,'Breakdown & Project Funding'!C$15)","v":0},{"$f":"SUMIFS('1. Costs linked to activities'!$K:$K,'1. Costs linked to activities'!$E:$E,$B23,'1. Costs linked to activities'!$D:$D,D$15)+SUMIFS('2. Communication Costs'!$K:$K,'2. Communication Costs'!$E:$E,'Breakdown & Project Funding'!$B23,'2. Communication Costs'!$D:$D,'Breakdown & Project Funding'!D$15)+SUMIFS('3. Travel & Subsistence costs'!$R:$R,'3. Travel & Subsistence costs'!$E:$E,'Breakdown & Project Funding'!$B23,'3. Travel & Subsistence costs'!$D:$D,'Breakdown & Project Funding'!D$15)+SUMIFS('4. Personnel  costs'!$W:$W,'4. Personnel  costs'!$E:$E,'Breakdown & Project Funding'!$B23,'4. Personnel  costs'!$D:$D,'Breakdown & Project Funding'!D$15)+SUMIFS('5. Indirect Costs'!$J:$J,'5. Indirect Costs'!$E:$E,'Breakdown & Project Funding'!$B23,'5. Indirect Costs'!$D:$D,'Breakdown & Project Funding'!D$15)","v":0},{"$f":"SUMIFS('1. Costs linked to activities'!$K:$K,'1. Costs linked to activities'!$E:$E,$B23,'1. Costs linked to activities'!$D:$D,E$15)+SUMIFS('2. Communication Costs'!$K:$K,'2. Communication Costs'!$E:$E,'Breakdown & Project Funding'!$B23,'2. Communication Costs'!$D:$D,'Breakdown & Project Funding'!E$15)+SUMIFS('3. Travel & Subsistence costs'!$R:$R,'3. Travel & Subsistence costs'!$E:$E,'Breakdown & Project Funding'!$B23,'3. Travel & Subsistence costs'!$D:$D,'Breakdown & Project Funding'!E$15)+SUMIFS('4. Personnel  costs'!$W:$W,'4. Personnel  costs'!$E:$E,'Breakdown & Project Funding'!$B23,'4. Personnel  costs'!$D:$D,'Breakdown & Project Funding'!E$15)+SUMIFS('5. Indirect Costs'!$J:$J,'5. Indirect Costs'!$E:$E,'Breakdown & Project Funding'!$B23,'5. Indirect Costs'!$D:$D,'Breakdown & Project Funding'!E$15)","v":0},{"$f":"SUMIFS('1. Costs linked to activities'!$K:$K,'1. Costs linked to activities'!$E:$E,$B23,'1. Costs linked to activities'!$D:$D,F$15)+SUMIFS('2. Communication Costs'!$K:$K,'2. Communication Costs'!$E:$E,'Breakdown & Project Funding'!$B23,'2. Communication Costs'!$D:$D,'Breakdown & Project Funding'!F$15)+SUMIFS('3. Travel & Subsistence costs'!$R:$R,'3. Travel & Subsistence costs'!$E:$E,'Breakdown & Project Funding'!$B23,'3. Travel & Subsistence costs'!$D:$D,'Breakdown & Project Funding'!F$15)+SUMIFS('4. Personnel  costs'!$W:$W,'4. Personnel  costs'!$E:$E,'Breakdown & Project Funding'!$B23,'4. Personnel  costs'!$D:$D,'Breakdown & Project Funding'!F$15)+SUMIFS('5. Indirect Costs'!$J:$J,'5. Indirect Costs'!$E:$E,'Breakdown & Project Funding'!$B23,'5. Indirect Costs'!$D:$D,'Breakdown & Project Funding'!F$15)","v":0},{"$f":"SUMIFS('1. Costs linked to activities'!$K:$K,'1. Costs linked to activities'!$E:$E,$B23,'1. Costs linked to activities'!$D:$D,G$15)+SUMIFS('2. Communication Costs'!$K:$K,'2. Communication Costs'!$E:$E,'Breakdown & Project Funding'!$B23,'2. Communication Costs'!$D:$D,'Breakdown & Project Funding'!G$15)+SUMIFS('3. Travel & Subsistence costs'!$R:$R,'3. Travel & Subsistence costs'!$E:$E,'Breakdown & Project Funding'!$B23,'3. Travel & Subsistence costs'!$D:$D,'Breakdown & Project Funding'!G$15)+SUMIFS('4. Personnel  costs'!$W:$W,'4. Personnel  costs'!$E:$E,'Breakdown & Project Funding'!$B23,'4. Personnel  costs'!$D:$D,'Breakdown & Project Funding'!G$15)+SUMIFS('5. Indirect Costs'!$J:$J,'5. Indirect Costs'!$E:$E,'Breakdown & Project Funding'!$B23,'5. Indirect Costs'!$D:$D,'Breakdown & Project Funding'!G$15)","v":0},0]
[null,"P9",{"$f":"SUMIFS('1. Costs linked to activities'!$K:$K,'1. Costs linked to activities'!$E:$E,$B24,'1. Costs linked to activities'!$D:$D,C$15)+SUMIFS('2. Communication Costs'!$K:$K,'2. Communication Costs'!$E:$E,'Breakdown & Project Funding'!$B24,'2. Communication Costs'!$D:$D,'Breakdown & Project Funding'!C$15)+SUMIFS('3. Travel & Subsistence costs'!$R:$R,'3. Travel & Subsistence costs'!$E:$E,'Breakdown & Project Funding'!$B24,'3. Travel & Subsistence costs'!$D:$D,'Breakdown & Project Funding'!C$15)+SUMIFS('4. Personnel  costs'!$W:$W,'4. Personnel  costs'!$E:$E,'Breakdown & Project Funding'!$B24,'4. Personnel  costs'!$D:$D,'Breakdown & Project Funding'!C$15)+SUMIFS('5. Indirect Costs'!$J:$J,'5. Indirect Costs'!$E:$E,'Breakdown & Project Funding'!$B24,'5. Indirect Costs'!$D:$D,'Breakdown & Project Funding'!C$15)","v":0},{"$f":"SUMIFS('1. Costs linked to activities'!$K:$K,'1. Costs linked to activities'!$E:$E,$B24,'1. Costs linked to activities'!$D:$D,D$15)+SUMIFS('2. Communication Costs'!$K:$K,'2. Communication Costs'!$E:$E,'Breakdown & Project Funding'!$B24,'2. Communication Costs'!$D:$D,'Breakdown & Project Funding'!D$15)+SUMIFS('3. Travel & Subsistence costs'!$R:$R,'3. Travel & Subsistence costs'!$E:$E,'Breakdown & Project Funding'!$B24,'3. Travel & Subsistence costs'!$D:$D,'Breakdown & Project Funding'!D$15)+SUMIFS('4. Personnel  costs'!$W:$W,'4. Personnel  costs'!$E:$E,'Breakdown & Project Funding'!$B24,'4. Personnel  costs'!$D:$D,'Breakdown & Project Funding'!D$15)+SUMIFS('5. Indirect Costs'!$J:$J,'5. Indirect Costs'!$E:$E,'Breakdown & Project Funding'!$B24,'5. Indirect Costs'!$D:$D,'Breakdown & Project Funding'!D$15)","v":0},{"$f":"SUMIFS('1. Costs linked to activities'!$K:$K,'1. Costs linked to activities'!$E:$E,$B24,'1. Costs linked to activities'!$D:$D,E$15)+SUMIFS('2. Communication Costs'!$K:$K,'2. Communication Costs'!$E:$E,'Breakdown & Project Funding'!$B24,'2. Communication Costs'!$D:$D,'Breakdown & Project Funding'!E$15)+SUMIFS('3. Travel & Subsistence costs'!$R:$R,'3. Travel & Subsistence costs'!$E:$E,'Breakdown & Project Funding'!$B24,'3. Travel & Subsistence costs'!$D:$D,'Breakdown & Project Funding'!E$15)+SUMIFS('4. Personnel  costs'!$W:$W,'4. Personnel  costs'!$E:$E,'Breakdown & Project Funding'!$B24,'4. Personnel  costs'!$D:$D,'Breakdown & Project Funding'!E$15)+SUMIFS('5. Indirect Costs'!$J:$J,'5. Indirect Costs'!$E:$E,'Breakdown & Project Funding'!$B24,'5. Indirect Costs'!$D:$D,'Breakdown & Project Funding'!E$15)","v":0},{"$f":"SUMIFS('1. Costs linked to activities'!$K:$K,'1. Costs linked to activities'!$E:$E,$B24,'1. Costs linked to activities'!$D:$D,F$15)+SUMIFS('2. Communication Costs'!$K:$K,'2. Communication Costs'!$E:$E,'Breakdown & Project Funding'!$B24,'2. Communication Costs'!$D:$D,'Breakdown & Project Funding'!F$15)+SUMIFS('3. Travel & Subsistence costs'!$R:$R,'3. Travel & Subsistence costs'!$E:$E,'Breakdown & Project Funding'!$B24,'3. Travel & Subsistence costs'!$D:$D,'Breakdown & Project Funding'!F$15)+SUMIFS('4. Personnel  costs'!$W:$W,'4. Personnel  costs'!$E:$E,'Breakdown & Project Funding'!$B24,'4. Personnel  costs'!$D:$D,'Breakdown & Project Funding'!F$15)+SUMIFS('5. Indirect Costs'!$J:$J,'5. Indirect Costs'!$E:$E,'Breakdown & Project Funding'!$B24,'5. Indirect Costs'!$D:$D,'Breakdown & Project Funding'!F$15)","v":0},{"$f":"SUMIFS('1. Costs linked to activities'!$K:$K,'1. Costs linked to activities'!$E:$E,$B24,'1. Costs linked to activities'!$D:$D,G$15)+SUMIFS('2. Communication Costs'!$K:$K,'2. Communication Costs'!$E:$E,'Breakdown & Project Funding'!$B24,'2. Communication Costs'!$D:$D,'Breakdown & Project Funding'!G$15)+SUMIFS('3. Travel & Subsistence costs'!$R:$R,'3. Travel & Subsistence costs'!$E:$E,'Breakdown & Project Funding'!$B24,'3. Travel & Subsistence costs'!$D:$D,'Breakdown & Project Funding'!G$15)+SUMIFS('4. Personnel  costs'!$W:$W,'4. Personnel  costs'!$E:$E,'Breakdown & Project Funding'!$B24,'4. Personnel  costs'!$D:$D,'Breakdown & Project Funding'!G$15)+SUMIFS('5. Indirect Costs'!$J:$J,'5. Indirect Costs'!$E:$E,'Breakdown & Project Funding'!$B24,'5. Indirect Costs'!$D:$D,'Breakdown & Project Funding'!G$15)","v":0},0]
[null,"P10",{"$f":"SUMIFS('1. Costs linked to activities'!$K:$K,'1. Costs linked to activities'!$E:$E,$B25,'1. Costs linked to activities'!$D:$D,C$15)+SUMIFS('2. Communication Costs'!$K:$K,'2. Communication Costs'!$E:$E,'Breakdown & Project Funding'!$B25,'2. Communication Costs'!$D:$D,'Breakdown & Project Funding'!C$15)+SUMIFS('3. Travel & Subsistence costs'!$R:$R,'3. Travel & Subsistence costs'!$E:$E,'Breakdown & Project Funding'!$B25,'3. Travel & Subsistence costs'!$D:$D,'Breakdown & Project Funding'!C$15)+SUMIFS('4. Personnel  costs'!$W:$W,'4. Personnel  costs'!$E:$E,'Breakdown & Project Funding'!$B25,'4. Personnel  costs'!$D:$D,'Breakdown & Project Funding'!C$15)+SUMIFS('5. Indirect Costs'!$J:$J,'5. Indirect Costs'!$E:$E,'Breakdown & Project Funding'!$B25,'5. Indirect Costs'!$D:$D,'Breakdown & Project Funding'!C$15)","v":0},{"$f":"SUMIFS('1. Costs linked to activities'!$K:$K,'1. Costs linked to activities'!$E:$E,$B25,'1. Costs linked to activities'!$D:$D,D$15)+SUMIFS('2. Communication Costs'!$K:$K,'2. Communication Costs'!$E:$E,'Breakdown & Project Funding'!$B25,'2. Communication Costs'!$D:$D,'Breakdown & Project Funding'!D$15)+SUMIFS('3. Travel & Subsistence costs'!$R:$R,'3. Travel & Subsistence costs'!$E:$E,'Breakdown & Project Funding'!$B25,'3. Travel & Subsistence costs'!$D:$D,'Breakdown & Project Funding'!D$15)+SUMIFS('4. Personnel  costs'!$W:$W,'4. Personnel  costs'!$E:$E,'Breakdown & Project Funding'!$B25,'4. Personnel  costs'!$D:$D,'Breakdown & Project Funding'!D$15)+SUMIFS('5. Indirect Costs'!$J:$J,'5. Indirect Costs'!$E:$E,'Breakdown & Project Funding'!$B25,'5. Indirect Costs'!$D:$D,'Breakdown & Project Funding'!D$15)","v":0},{"$f":"SUMIFS('1. Costs linked to activities'!$K:$K,'1. Costs linked to activities'!$E:$E,$B25,'1. Costs linked to activities'!$D:$D,E$15)+SUMIFS('2. Communication Costs'!$K:$K,'2. Communication Costs'!$E:$E,'Breakdown & Project Funding'!$B25,'2. Communication Costs'!$D:$D,'Breakdown & Project Funding'!E$15)+SUMIFS('3. Travel & Subsistence costs'!$R:$R,'3. Travel & Subsistence costs'!$E:$E,'Breakdown & Project Funding'!$B25,'3. Travel & Subsistence costs'!$D:$D,'Breakdown & Project Funding'!E$15)+SUMIFS('4. Personnel  costs'!$W:$W,'4. Personnel  costs'!$E:$E,'Breakdown & Project Funding'!$B25,'4. Personnel  costs'!$D:$D,'Breakdown & Project Funding'!E$15)+SUMIFS('5. Indirect Costs'!$J:$J,'5. Indirect Costs'!$E:$E,'Breakdown & Project Funding'!$B25,'5. Indirect Costs'!$D:$D,'Breakdown & Project Funding'!E$15)","v":0},{"$f":"SUMIFS('1. Costs linked to activities'!$K:$K,'1. Costs linked to activities'!$E:$E,$B25,'1. Costs linked to activities'!$D:$D,F$15)+SUMIFS('2. Communication Costs'!$K:$K,'2. Communication Costs'!$E:$E,'Breakdown & Project Funding'!$B25,'2. Communication Costs'!$D:$D,'Breakdown & Project Funding'!F$15)+SUMIFS('3. Travel & Subsistence costs'!$R:$R,'3. Travel & Subsistence costs'!$E:$E,'Breakdown & Project Funding'!$B25,'3. Travel & Subsistence costs'!$D:$D,'Breakdown & Project Funding'!F$15)+SUMIFS('4. Personnel  costs'!$W:$W,'4. Personnel  costs'!$E:$E,'Breakdown & Project Funding'!$B25,'4. Personnel  costs'!$D:$D,'Breakdown & Project Funding'!F$15)+SUMIFS('5. Indirect Costs'!$J:$J,'5. Indirect Costs'!$E:$E,'Breakdown & Project Funding'!$B25,'5. Indirect Costs'!$D:$D,'Breakdown & Project Funding'!F$15)","v":0},{"$f":"SUMIFS('1. Costs linked to activities'!$K:$K,'1. Costs linked to activities'!$E:$E,$B25,'1. Costs linked to activities'!$D:$D,G$15)+SUMIFS('2. Communication Costs'!$K:$K,'2. Communication Costs'!$E:$E,'Breakdown & Project Funding'!$B25,'2. Communication Costs'!$D:$D,'Breakdown & Project Funding'!G$15)+SUMIFS('3. Travel & Subsistence costs'!$R:$R,'3. Travel & Subsistence costs'!$E:$E,'Breakdown & Project Funding'!$B25,'3. Travel & Subsistence costs'!$D:$D,'Breakdown & Project Funding'!G$15)+SUMIFS('4. Personnel  costs'!$W:$W,'4. Personnel  costs'!$E:$E,'Breakdown & Project Funding'!$B25,'4. Personnel  costs'!$D:$D,'Breakdown & Project Funding'!G$15)+SUMIFS('5. Indirect Costs'!$J:$J,'5. Indirect Costs'!$E:$E,'Breakdown & Project Funding'!$B25,'5. Indirect Costs'!$D:$D,'Breakdown & Project Funding'!G$15)","v":0},0]
[null,"P11",{"$f":"SUMIFS('1. Costs linked to activities'!$K:$K,'1. Costs linked to activities'!$E:$E,$B26,'1. Costs linked to activities'!$D:$D,C$15)+SUMIFS('2. Communication Costs'!$K:$K,'2. Communication Costs'!$E:$E,'Breakdown & Project Funding'!$B26,'2. Communication Costs'!$D:$D,'Breakdown & Project Funding'!C$15)+SUMIFS('3. Travel & Subsistence costs'!$R:$R,'3. Travel & Subsistence costs'!$E:$E,'Breakdown & Project Funding'!$B26,'3. Travel & Subsistence costs'!$D:$D,'Breakdown & Project Funding'!C$15)+SUMIFS('4. Personnel  costs'!$W:$W,'4. Personnel  costs'!$E:$E,'Breakdown & Project Funding'!$B26,'4. Personnel  costs'!$D:$D,'Breakdown & Project Funding'!C$15)+SUMIFS('5. Indirect Costs'!$J:$J,'5. Indirect Costs'!$E:$E,'Breakdown & Project Funding'!$B26,'5. Indirect Costs'!$D:$D,'Breakdown & Project Funding'!C$15)","v":0},{"$f":"SUMIFS('1. Costs linked to activities'!$K:$K,'1. Costs linked to activities'!$E:$E,$B26,'1. Costs linked to activities'!$D:$D,D$15)+SUMIFS('2. Communication Costs'!$K:$K,'2. Communication Costs'!$E:$E,'Breakdown & Project Funding'!$B26,'2. Communication Costs'!$D:$D,'Breakdown & Project Funding'!D$15)+SUMIFS('3. Travel & Subsistence costs'!$R:$R,'3. Travel & Subsistence costs'!$E:$E,'Breakdown & Project Funding'!$B26,'3. Travel & Subsistence costs'!$D:$D,'Breakdown & Project Funding'!D$15)+SUMIFS('4. Personnel  costs'!$W:$W,'4. Personnel  costs'!$E:$E,'Breakdown & Project Funding'!$B26,'4. Personnel  costs'!$D:$D,'Breakdown & Project Funding'!D$15)+SUMIFS('5. Indirect Costs'!$J:$J,'5. Indirect Costs'!$E:$E,'Breakdown & Project Funding'!$B26,'5. Indirect Costs'!$D:$D,'Breakdown & Project Funding'!D$15)","v":0},{"$f":"SUMIFS('1. Costs linked to activities'!$K:$K,'1. Costs linked to activities'!$E:$E,$B26,'1. Costs linked to activities'!$D:$D,E$15)+SUMIFS('2. Communication Costs'!$K:$K,'2. Communication Costs'!$E:$E,'Breakdown & Project Funding'!$B26,'2. Communication Costs'!$D:$D,'Breakdown & Project Funding'!E$15)+SUMIFS('3. Travel & Subsistence costs'!$R:$R,'3. Travel & Subsistence costs'!$E:$E,'Breakdown & Project Funding'!$B26,'3. Travel & Subsistence costs'!$D:$D,'Breakdown & Project Funding'!E$15)+SUMIFS('4. Personnel  costs'!$W:$W,'4. Personnel  costs'!$E:$E,'Breakdown & Project Funding'!$B26,'4. Personnel  costs'!$D:$D,'Breakdown & Project Funding'!E$15)+SUMIFS('5. Indirect Costs'!$J:$J,'5. Indirect Costs'!$E:$E,'Breakdown & Project Funding'!$B26,'5. Indirect Costs'!$D:$D,'Breakdown & Project Funding'!E$15)","v":0},{"$f":"SUMIFS('1. Costs linked to activities'!$K:$K,'1. Costs linked to activities'!$E:$E,$B26,'1. Costs linked to activities'!$D:$D,F$15)+SUMIFS('2. Communication Costs'!$K:$K,'2. Communication Costs'!$E:$E,'Breakdown & Project Funding'!$B26,'2. Communication Costs'!$D:$D,'Breakdown & Project Funding'!F$15)+SUMIFS('3. Travel & Subsistence costs'!$R:$R,'3. Travel & Subsistence costs'!$E:$E,'Breakdown & Project Funding'!$B26,'3. Travel & Subsistence costs'!$D:$D,'Breakdown & Project Funding'!F$15)+SUMIFS('4. Personnel  costs'!$W:$W,'4. Personnel  costs'!$E:$E,'Breakdown & Project Funding'!$B26,'4. Personnel  costs'!$D:$D,'Breakdown & Project Funding'!F$15)+SUMIFS('5. Indirect Costs'!$J:$J,'5. Indirect Costs'!$E:$E,'Breakdown & Project Funding'!$B26,'5. Indirect Costs'!$D:$D,'Breakdown & Project Funding'!F$15)","v":0},{"$f":"SUMIFS('1. Costs linked to activities'!$K:$K,'1. Costs linked to activities'!$E:$E,$B26,'1. Costs linked to activities'!$D:$D,G$15)+SUMIFS('2. Communication Costs'!$K:$K,'2. Communication Costs'!$E:$E,'Breakdown & Project Funding'!$B26,'2. Communication Costs'!$D:$D,'Breakdown & Project Funding'!G$15)+SUMIFS('3. Travel & Subsistence costs'!$R:$R,'3. Travel & Subsistence costs'!$E:$E,'Breakdown & Project Funding'!$B26,'3. Travel & Subsistence costs'!$D:$D,'Breakdown & Project Funding'!G$15)+SUMIFS('4. Personnel  costs'!$W:$W,'4. Personnel  costs'!$E:$E,'Breakdown & Project Funding'!$B26,'4. Personnel  costs'!$D:$D,'Breakdown & Project Funding'!G$15)+SUMIFS('5. Indirect Costs'!$J:$J,'5. Indirect Costs'!$E:$E,'Breakdown & Project Funding'!$B26,'5. Indirect Costs'!$D:$D,'Breakdown & Project Funding'!G$15)","v":0},0]
[null,"P12",{"$f":"SUMIFS('1. Costs linked to activities'!$K:$K,'1. Costs linked to activities'!$E:$E,$B27,'1. Costs linked to activities'!$D:$D,C$15)+SUMIFS('2. Communication Costs'!$K:$K,'2. Communication Costs'!$E:$E,'Breakdown & Project Funding'!$B27,'2. Communication Costs'!$D:$D,'Breakdown & Project Funding'!C$15)+SUMIFS('3. Travel & Subsistence costs'!$R:$R,'3. Travel & Subsistence costs'!$E:$E,'Breakdown & Project Funding'!$B27,'3. Travel & Subsistence costs'!$D:$D,'Breakdown & Project Funding'!C$15)+SUMIFS('4. Personnel  costs'!$W:$W,'4. Personnel  costs'!$E:$E,'Breakdown & Project Funding'!$B27,'4. Personnel  costs'!$D:$D,'Breakdown & Project Funding'!C$15)+SUMIFS('5. Indirect Costs'!$J:$J,'5. Indirect Costs'!$E:$E,'Breakdown & Project Funding'!$B27,'5. Indirect Costs'!$D:$D,'Breakdown & Project Funding'!C$15)","v":0},{"$f":"SUMIFS('1. Costs linked to activities'!$K:$K,'1. Costs linked to activities'!$E:$E,$B27,'1. Costs linked to activities'!$D:$D,D$15)+SUMIFS('2. Communication Costs'!$K:$K,'2. Communication Costs'!$E:$E,'Breakdown & Project Funding'!$B27,'2. Communication Costs'!$D:$D,'Breakdown & Project Funding'!D$15)+SUMIFS('3. Travel & Subsistence costs'!$R:$R,'3. Travel & Subsistence costs'!$E:$E,'Breakdown & Project Funding'!$B27,'3. Travel & Subsistence costs'!$D:$D,'Breakdown & Project Funding'!D$15)+SUMIFS('4. Personnel  costs'!$W:$W,'4. Personnel  costs'!$E:$E,'Breakdown & Project Funding'!$B27,'4. Personnel  costs'!$D:$D,'Breakdown & Project Funding'!D$15)+SUMIFS('5. Indirect Costs'!$J:$J,'5. Indirect Costs'!$E:$E,'Breakdown & Project Funding'!$B27,'5. Indirect Costs'!$D:$D,'Breakdown & Project Funding'!D$15)","v":0},{"$f":"SUMIFS('1. Costs linked to activities'!$K:$K,'1. Costs linked to activities'!$E:$E,$B27,'1. Costs linked to activities'!$D:$D,E$15)+SUMIFS('2. Communication Costs'!$K:$K,'2. Communication Costs'!$E:$E,'Breakdown & Project Funding'!$B27,'2. Communication Costs'!$D:$D,'Breakdown & Project Funding'!E$15)+SUMIFS('3. Travel & Subsistence costs'!$R:$R,'3. Travel & Subsistence costs'!$E:$E,'Breakdown & Project Funding'!$B27,'3. Travel & Subsistence costs'!$D:$D,'Breakdown & Project Funding'!E$15)+SUMIFS('4. Personnel  costs'!$W:$W,'4. Personnel  costs'!$E:$E,'Breakdown & Project Funding'!$B27,'4. Personnel  costs'!$D:$D,'Breakdown & Project Funding'!E$15)+SUMIFS('5. Indirect Costs'!$J:$J,'5. Indirect Costs'!$E:$E,'Breakdown & Project Funding'!$B27,'5. Indirect Costs'!$D:$D,'Breakdown & Project Funding'!E$15)","v":0},{"$f":"SUMIFS('1. Costs linked to activities'!$K:$K,'1. Costs linked to activities'!$E:$E,$B27,'1. Costs linked to activities'!$D:$D,F$15)+SUMIFS('2. Communication Costs'!$K:$K,'2. Communication Costs'!$E:$E,'Breakdown & Project Funding'!$B27,'2. Communication Costs'!$D:$D,'Breakdown & Project Funding'!F$15)+SUMIFS('3. Travel & Subsistence costs'!$R:$R,'3. Travel & Subsistence costs'!$E:$E,'Breakdown & Project Funding'!$B27,'3. Travel & Subsistence costs'!$D:$D,'Breakdown & Project Funding'!F$15)+SUMIFS('4. Personnel  costs'!$W:$W,'4. Personnel  costs'!$E:$E,'Breakdown & Project Funding'!$B27,'4. Personnel  costs'!$D:$D,'Breakdown & Project Funding'!F$15)+SUMIFS('5. Indirect Costs'!$J:$J,'5. Indirect Costs'!$E:$E,'Breakdown & Project Funding'!$B27,'5. Indirect Costs'!$D:$D,'Breakdown & Project Funding'!F$15)","v":0},{"$f":"SUMIFS('1. Costs linked to activities'!$K:$K,'1. Costs linked to activities'!$E:$E,$B27,'1. Costs linked to activities'!$D:$D,G$15)+SUMIFS('2. Communication Costs'!$K:$K,'2. Communication Costs'!$E:$E,'Breakdown & Project Funding'!$B27,'2. Communication Costs'!$D:$D,'Breakdown & Project Funding'!G$15)+SUMIFS('3. Travel & Subsistence costs'!$R:$R,'3. Travel & Subsistence costs'!$E:$E,'Breakdown & Project Funding'!$B27,'3. Travel & Subsistence costs'!$D:$D,'Breakdown & Project Funding'!G$15)+SUMIFS('4. Personnel  costs'!$W:$W,'4. Personnel  costs'!$E:$E,'Breakdown & Project Funding'!$B27,'4. Personnel  costs'!$D:$D,'Breakdown & Project Funding'!G$15)+SUMIFS('5. Indirect Costs'!$J:$J,'5. Indirect Costs'!$E:$E,'Breakdown & Project Funding'!$B27,'5. Indirect Costs'!$D:$D,'Breakdown & Project Funding'!G$15)","v":0},0]
[null,"P13",{"$f":"SUMIFS('1. Costs linked to activities'!$K:$K,'1. Costs linked to activities'!$E:$E,$B28,'1. Costs linked to activities'!$D:$D,C$15)+SUMIFS('2. Communication Costs'!$K:$K,'2. Communication Costs'!$E:$E,'Breakdown & Project Funding'!$B28,'2. Communication Costs'!$D:$D,'Breakdown & Project Funding'!C$15)+SUMIFS('3. Travel & Subsistence costs'!$R:$R,'3. Travel & Subsistence costs'!$E:$E,'Breakdown & Project Funding'!$B28,'3. Travel & Subsistence costs'!$D:$D,'Breakdown & Project Funding'!C$15)+SUMIFS('4. Personnel  costs'!$W:$W,'4. Personnel  costs'!$E:$E,'Breakdown & Project Funding'!$B28,'4. Personnel  costs'!$D:$D,'Breakdown & Project Funding'!C$15)+SUMIFS('5. Indirect Costs'!$J:$J,'5. Indirect Costs'!$E:$E,'Breakdown & Project Funding'!$B28,'5. Indirect Costs'!$D:$D,'Breakdown & Project Funding'!C$15)","v":0},{"$f":"SUMIFS('1. Costs linked to activities'!$K:$K,'1. Costs linked to activities'!$E:$E,$B28,'1. Costs linked to activities'!$D:$D,D$15)+SUMIFS('2. Communication Costs'!$K:$K,'2. Communication Costs'!$E:$E,'Breakdown & Project Funding'!$B28,'2. Communication Costs'!$D:$D,'Breakdown & Project Funding'!D$15)+SUMIFS('3. Travel & Subsistence costs'!$R:$R,'3. Travel & Subsistence costs'!$E:$E,'Breakdown & Project Funding'!$B28,'3. Travel & Subsistence costs'!$D:$D,'Breakdown & Project Funding'!D$15)+SUMIFS('4. Personnel  costs'!$W:$W,'4. Personnel  costs'!$E:$E,'Breakdown & Project Funding'!$B28,'4. Personnel  costs'!$D:$D,'Breakdown & Project Funding'!D$15)+SUMIFS('5. Indirect Costs'!$J:$J,'5. Indirect Costs'!$E:$E,'Breakdown & Project Funding'!$B28,'5. Indirect Costs'!$D:$D,'Breakdown & Project Funding'!D$15)","v":0},{"$f":"SUMIFS('1. Costs linked to activities'!$K:$K,'1. Costs linked to activities'!$E:$E,$B28,'1. Costs linked to activities'!$D:$D,E$15)+SUMIFS('2. Communication Costs'!$K:$K,'2. Communication Costs'!$E:$E,'Breakdown & Project Funding'!$B28,'2. Communication Costs'!$D:$D,'Breakdown & Project Funding'!E$15)+SUMIFS('3. Travel & Subsistence costs'!$R:$R,'3. Travel & Subsistence costs'!$E:$E,'Breakdown & Project Funding'!$B28,'3. Travel & Subsistence costs'!$D:$D,'Breakdown & Project Funding'!E$15)+SUMIFS('4. Personnel  costs'!$W:$W,'4. Personnel  costs'!$E:$E,'Breakdown & Project Funding'!$B28,'4. Personnel  costs'!$D:$D,'Breakdown & Project Funding'!E$15)+SUMIFS('5. Indirect Costs'!$J:$J,'5. Indirect Costs'!$E:$E,'Breakdown & Project Funding'!$B28,'5. Indirect Costs'!$D:$D,'Breakdown & Project Funding'!E$15)","v":0},{"$f":"SUMIFS('1. Costs linked to activities'!$K:$K,'1. Costs linked to activities'!$E:$E,$B28,'1. Costs linked to activities'!$D:$D,F$15)+SUMIFS('2. Communication Costs'!$K:$K,'2. Communication Costs'!$E:$E,'Breakdown & Project Funding'!$B28,'2. Communication Costs'!$D:$D,'Breakdown & Project Funding'!F$15)+SUMIFS('3. Travel & Subsistence costs'!$R:$R,'3. Travel & Subsistence costs'!$E:$E,'Breakdown & Project Funding'!$B28,'3. Travel & Subsistence costs'!$D:$D,'Breakdown & Project Funding'!F$15)+SUMIFS('4. Personnel  costs'!$W:$W,'4. Personnel  costs'!$E:$E,'Breakdown & Project Funding'!$B28,'4. Personnel  costs'!$D:$D,'Breakdown & Project Funding'!F$15)+SUMIFS('5. Indirect Costs'!$J:$J,'5. Indirect Costs'!$E:$E,'Breakdown & Project Funding'!$B28,'5. Indirect Costs'!$D:$D,'Breakdown & Project Funding'!F$15)","v":0},{"$f":"SUMIFS('1. Costs linked to activities'!$K:$K,'1. Costs linked to activities'!$E:$E,$B28,'1. Costs linked to activities'!$D:$D,G$15)+SUMIFS('2. Communication Costs'!$K:$K,'2. Communication Costs'!$E:$E,'Breakdown & Project Funding'!$B28,'2. Communication Costs'!$D:$D,'Breakdown & Project Funding'!G$15)+SUMIFS('3. Travel & Subsistence costs'!$R:$R,'3. Travel & Subsistence costs'!$E:$E,'Breakdown & Project Funding'!$B28,'3. Travel & Subsistence costs'!$D:$D,'Breakdown & Project Funding'!G$15)+SUMIFS('4. Personnel  costs'!$W:$W,'4. Personnel  costs'!$E:$E,'Breakdown & Project Funding'!$B28,'4. Personnel  costs'!$D:$D,'Breakdown & Project Funding'!G$15)+SUMIFS('5. Indirect Costs'!$J:$J,'5. Indirect Costs'!$E:$E,'Breakdown & Project Funding'!$B28,'5. Indirect Costs'!$D:$D,'Breakdown & Project Funding'!G$15)","v":0},0]
[null,"P14",{"$f":"SUMIFS('1. Costs linked to activities'!$K:$K,'1. Costs linked to activities'!$E:$E,$B29,'1. Costs linked to activities'!$D:$D,C$15)+SUMIFS('2. Communication Costs'!$K:$K,'2. Communication Costs'!$E:$E,'Breakdown & Project Funding'!$B29,'2. Communication Costs'!$D:$D,'Breakdown & Project Funding'!C$15)+SUMIFS('3. Travel & Subsistence costs'!$R:$R,'3. Travel & Subsistence costs'!$E:$E,'Breakdown & Project Funding'!$B29,'3. Travel & Subsistence costs'!$D:$D,'Breakdown & Project Funding'!C$15)+SUMIFS('4. Personnel  costs'!$W:$W,'4. Personnel  costs'!$E:$E,'Breakdown & Project Funding'!$B29,'4. Personnel  costs'!$D:$D,'Breakdown & Project Funding'!C$15)+SUMIFS('5. Indirect Costs'!$J:$J,'5. Indirect Costs'!$E:$E,'Breakdown & Project Funding'!$B29,'5. Indirect Costs'!$D:$D,'Breakdown & Project Funding'!C$15)","v":0},{"$f":"SUMIFS('1. Costs linked to activities'!$K:$K,'1. Costs linked to activities'!$E:$E,$B29,'1. Costs linked to activities'!$D:$D,D$15)+SUMIFS('2. Communication Costs'!$K:$K,'2. Communication Costs'!$E:$E,'Breakdown & Project Funding'!$B29,'2. Communication Costs'!$D:$D,'Breakdown & Project Funding'!D$15)+SUMIFS('3. Travel & Subsistence costs'!$R:$R,'3. Travel & Subsistence costs'!$E:$E,'Breakdown & Project Funding'!$B29,'3. Travel & Subsistence costs'!$D:$D,'Breakdown & Project Funding'!D$15)+SUMIFS('4. Personnel  costs'!$W:$W,'4. Personnel  costs'!$E:$E,'Breakdown & Project Funding'!$B29,'4. Personnel  costs'!$D:$D,'Breakdown & Project Funding'!D$15)+SUMIFS('5. Indirect Costs'!$J:$J,'5. Indirect Costs'!$E:$E,'Breakdown & Project Funding'!$B29,'5. Indirect Costs'!$D:$D,'Breakdown & Project Funding'!D$15)","v":0},{"$f":"SUMIFS('1. Costs linked to activities'!$K:$K,'1. Costs linked to activities'!$E:$E,$B29,'1. Costs linked to activities'!$D:$D,E$15)+SUMIFS('2. Communication Costs'!$K:$K,'2. Communication Costs'!$E:$E,'Breakdown & Project Funding'!$B29,'2. Communication Costs'!$D:$D,'Breakdown & Project Funding'!E$15)+SUMIFS('3. Travel & Subsistence costs'!$R:$R,'3. Travel & Subsistence costs'!$E:$E,'Breakdown & Project Funding'!$B29,'3. Travel & Subsistence costs'!$D:$D,'Breakdown & Project Funding'!E$15)+SUMIFS('4. Personnel  costs'!$W:$W,'4. Personnel  costs'!$E:$E,'Breakdown & Project Funding'!$B29,'4. Personnel  costs'!$D:$D,'Breakdown & Project Funding'!E$15)+SUMIFS('5. Indirect Costs'!$J:$J,'5. Indirect Costs'!$E:$E,'Breakdown & Project Funding'!$B29,'5. Indirect Costs'!$D:$D,'Breakdown & Project Funding'!E$15)","v":0},{"$f":"SUMIFS('1. Costs linked to activities'!$K:$K,'1. Costs linked to activities'!$E:$E,$B29,'1. Costs linked to activities'!$D:$D,F$15)+SUMIFS('2. Communication Costs'!$K:$K,'2. Communication Costs'!$E:$E,'Breakdown & Project Funding'!$B29,'2. Communication Costs'!$D:$D,'Breakdown & Project Funding'!F$15)+SUMIFS('3. Travel & Subsistence costs'!$R:$R,'3. Travel & Subsistence costs'!$E:$E,'Breakdown & Project Funding'!$B29,'3. Travel & Subsistence costs'!$D:$D,'Breakdown & Project Funding'!F$15)+SUMIFS('4. Personnel  costs'!$W:$W,'4. Personnel  costs'!$E:$E,'Breakdown & Project Funding'!$B29,'4. Personnel  costs'!$D:$D,'Breakdown & Project Funding'!F$15)+SUMIFS('5. Indirect Costs'!$J:$J,'5. Indirect Costs'!$E:$E,'Breakdown & Project Funding'!$B29,'5. Indirect Costs'!$D:$D,'Breakdown & Project Funding'!F$15)","v":0},{"$f":"SUMIFS('1. Costs linked to activities'!$K:$K,'1. Costs linked to activities'!$E:$E,$B29,'1. Costs linked to activities'!$D:$D,G$15)+SUMIFS('2. Communication Costs'!$K:$K,'2. Communication Costs'!$E:$E,'Breakdown & Project Funding'!$B29,'2. Communication Costs'!$D:$D,'Breakdown & Project Funding'!G$15)+SUMIFS('3. Travel & Subsistence costs'!$R:$R,'3. Travel & Subsistence costs'!$E:$E,'Breakdown & Project Funding'!$B29,'3. Travel & Subsistence costs'!$D:$D,'Breakdown & Project Funding'!G$15)+SUMIFS('4. Personnel  costs'!$W:$W,'4. Personnel  costs'!$E:$E,'Breakdown & Project Funding'!$B29,'4. Personnel  costs'!$D:$D,'Breakdown & Project Funding'!G$15)+SUMIFS('5. Indirect Costs'!$J:$J,'5. Indirect Costs'!$E:$E,'Breakdown & Project Funding'!$B29,'5. Indirect Costs'!$D:$D,'Breakdown & Project Funding'!G$15)","v":0},0]
[null,"P15",{"$f":"SUMIFS('1. Costs linked to activities'!$K:$K,'1. Costs linked to activities'!$E:$E,$B30,'1. Costs linked to activities'!$D:$D,C$15)+SUMIFS('2. Communication Costs'!$K:$K,'2. Communication Costs'!$E:$E,'Breakdown & Project Funding'!$B30,'2. Communication Costs'!$D:$D,'Breakdown & Project Funding'!C$15)+SUMIFS('3. Travel & Subsistence costs'!$R:$R,'3. Travel & Subsistence costs'!$E:$E,'Breakdown & Project Funding'!$B30,'3. Travel & Subsistence costs'!$D:$D,'Breakdown & Project Funding'!C$15)+SUMIFS('4. Personnel  costs'!$W:$W,'4. Personnel  costs'!$E:$E,'Breakdown & Project Funding'!$B30,'4. Personnel  costs'!$D:$D,'Breakdown & Project Funding'!C$15)+SUMIFS('5. Indirect Costs'!$J:$J,'5. Indirect Costs'!$E:$E,'Breakdown & Project Funding'!$B30,'5. Indirect Costs'!$D:$D,'Breakdown & Project Funding'!C$15)","v":0},{"$f":"SUMIFS('1. Costs linked to activities'!$K:$K,'1. Costs linked to activities'!$E:$E,$B30,'1. Costs linked to activities'!$D:$D,D$15)+SUMIFS('2. Communication Costs'!$K:$K,'2. Communication Costs'!$E:$E,'Breakdown & Project Funding'!$B30,'2. Communication Costs'!$D:$D,'Breakdown & Project Funding'!D$15)+SUMIFS('3. Travel & Subsistence costs'!$R:$R,'3. Travel & Subsistence costs'!$E:$E,'Breakdown & Project Funding'!$B30,'3. Travel & Subsistence costs'!$D:$D,'Breakdown & Project Funding'!D$15)+SUMIFS('4. Personnel  costs'!$W:$W,'4. Personnel  costs'!$E:$E,'Breakdown & Project Funding'!$B30,'4. Personnel  costs'!$D:$D,'Breakdown & Project Funding'!D$15)+SUMIFS('5. Indirect Costs'!$J:$J,'5. Indirect Costs'!$E:$E,'Breakdown & Project Funding'!$B30,'5. Indirect Costs'!$D:$D,'Breakdown & Project Funding'!D$15)","v":0},{"$f":"SUMIFS('1. Costs linked to activities'!$K:$K,'1. Costs linked to activities'!$E:$E,$B30,'1. Costs linked to activities'!$D:$D,E$15)+SUMIFS('2. Communication Costs'!$K:$K,'2. Communication Costs'!$E:$E,'Breakdown & Project Funding'!$B30,'2. Communication Costs'!$D:$D,'Breakdown & Project Funding'!E$15)+SUMIFS('3. Travel & Subsistence costs'!$R:$R,'3. Travel & Subsistence costs'!$E:$E,'Breakdown & Project Funding'!$B30,'3. Travel & Subsistence costs'!$D:$D,'Breakdown & Project Funding'!E$15)+SUMIFS('4. Personnel  costs'!$W:$W,'4. Personnel  costs'!$E:$E,'Breakdown & Project Funding'!$B30,'4. Personnel  costs'!$D:$D,'Breakdown & Project Funding'!E$15)+SUMIFS('5. Indirect Costs'!$J:$J,'5. Indirect Costs'!$E:$E,'Breakdown & Project Funding'!$B30,'5. Indirect Costs'!$D:$D,'Breakdown & Project Funding'!E$15)","v":0},{"$f":"SUMIFS('1. Costs linked to activities'!$K:$K,'1. Costs linked to activities'!$E:$E,$B30,'1. Costs linked to activities'!$D:$D,F$15)+SUMIFS('2. Communication Costs'!$K:$K,'2. Communication Costs'!$E:$E,'Breakdown & Project Funding'!$B30,'2. Communication Costs'!$D:$D,'Breakdown & Project Funding'!F$15)+SUMIFS('3. Travel & Subsistence costs'!$R:$R,'3. Travel & Subsistence costs'!$E:$E,'Breakdown & Project Funding'!$B30,'3. Travel & Subsistence costs'!$D:$D,'Breakdown & Project Funding'!F$15)+SUMIFS('4. Personnel  costs'!$W:$W,'4. Personnel  costs'!$E:$E,'Breakdown & Project Funding'!$B30,'4. Personnel  costs'!$D:$D,'Breakdown & Project Funding'!F$15)+SUMIFS('5. Indirect Costs'!$J:$J,'5. Indirect Costs'!$E:$E,'Breakdown & Project Funding'!$B30,'5. Indirect Costs'!$D:$D,'Breakdown & Project Funding'!F$15)","v":0},{"$f":"SUMIFS('1. Costs linked to activities'!$K:$K,'1. Costs linked to activities'!$E:$E,$B30,'1. Costs linked to activities'!$D:$D,G$15)+SUMIFS('2. Communication Costs'!$K:$K,'2. Communication Costs'!$E:$E,'Breakdown & Project Funding'!$B30,'2. Communication Costs'!$D:$D,'Breakdown & Project Funding'!G$15)+SUMIFS('3. Travel & Subsistence costs'!$R:$R,'3. Travel & Subsistence costs'!$E:$E,'Breakdown & Project Funding'!$B30,'3. Travel & Subsistence costs'!$D:$D,'Breakdown & Project Funding'!G$15)+SUMIFS('4. Personnel  costs'!$W:$W,'4. Personnel  costs'!$E:$E,'Breakdown & Project Funding'!$B30,'4. Personnel  costs'!$D:$D,'Breakdown & Project Funding'!G$15)+SUMIFS('5. Indirect Costs'!$J:$J,'5. Indirect Costs'!$E:$E,'Breakdown & Project Funding'!$B30,'5. Indirect Costs'!$D:$D,'Breakdown & Project Funding'!G$15)","v":0},0]
[null,"P16",{"$f":"SUMIFS('1. Costs linked to activities'!$K:$K,'1. Costs linked to activities'!$E:$E,$B31,'1. Costs linked to activities'!$D:$D,C$15)+SUMIFS('2. Communication Costs'!$K:$K,'2. Communication Costs'!$E:$E,'Breakdown & Project Funding'!$B31,'2. Communication Costs'!$D:$D,'Breakdown & Project Funding'!C$15)+SUMIFS('3. Travel & Subsistence costs'!$R:$R,'3. Travel & Subsistence costs'!$E:$E,'Breakdown & Project Funding'!$B31,'3. Travel & Subsistence costs'!$D:$D,'Breakdown & Project Funding'!C$15)+SUMIFS('4. Personnel  costs'!$W:$W,'4. Personnel  costs'!$E:$E,'Breakdown & Project Funding'!$B31,'4. Personnel  costs'!$D:$D,'Breakdown & Project Funding'!C$15)+SUMIFS('5. Indirect Costs'!$J:$J,'5. Indirect Costs'!$E:$E,'Breakdown & Project Funding'!$B31,'5. Indirect Costs'!$D:$D,'Breakdown & Project Funding'!C$15)","v":0},{"$f":"SUMIFS('1. Costs linked to activities'!$K:$K,'1. Costs linked to activities'!$E:$E,$B31,'1. Costs linked to activities'!$D:$D,D$15)+SUMIFS('2. Communication Costs'!$K:$K,'2. Communication Costs'!$E:$E,'Breakdown & Project Funding'!$B31,'2. Communication Costs'!$D:$D,'Breakdown & Project Funding'!D$15)+SUMIFS('3. Travel & Subsistence costs'!$R:$R,'3. Travel & Subsistence costs'!$E:$E,'Breakdown & Project Funding'!$B31,'3. Travel & Subsistence costs'!$D:$D,'Breakdown & Project Funding'!D$15)+SUMIFS('4. Personnel  costs'!$W:$W,'4. Personnel  costs'!$E:$E,'Breakdown & Project Funding'!$B31,'4. Personnel  costs'!$D:$D,'Breakdown & Project Funding'!D$15)+SUMIFS('5. Indirect Costs'!$J:$J,'5. Indirect Costs'!$E:$E,'Breakdown & Project Funding'!$B31,'5. Indirect Costs'!$D:$D,'Breakdown & Project Funding'!D$15)","v":0},{"$f":"SUMIFS('1. Costs linked to activities'!$K:$K,'1. Costs linked to activities'!$E:$E,$B31,'1. Costs linked to activities'!$D:$D,E$15)+SUMIFS('2. Communication Costs'!$K:$K,'2. Communication Costs'!$E:$E,'Breakdown & Project Funding'!$B31,'2. Communication Costs'!$D:$D,'Breakdown & Project Funding'!E$15)+SUMIFS('3. Travel & Subsistence costs'!$R:$R,'3. Travel & Subsistence costs'!$E:$E,'Breakdown & Project Funding'!$B31,'3. Travel & Subsistence costs'!$D:$D,'Breakdown & Project Funding'!E$15)+SUMIFS('4. Personnel  costs'!$W:$W,'4. Personnel  costs'!$E:$E,'Breakdown & Project Funding'!$B31,'4. Personnel  costs'!$D:$D,'Breakdown & Project Funding'!E$15)+SUMIFS('5. Indirect Costs'!$J:$J,'5. Indirect Costs'!$E:$E,'Breakdown & Project Funding'!$B31,'5. Indirect Costs'!$D:$D,'Breakdown & Project Funding'!E$15)","v":0},{"$f":"SUMIFS('1. Costs linked to activities'!$K:$K,'1. Costs linked to activities'!$E:$E,$B31,'1. Costs linked to activities'!$D:$D,F$15)+SUMIFS('2. Communication Costs'!$K:$K,'2. Communication Costs'!$E:$E,'Breakdown & Project Funding'!$B31,'2. Communication Costs'!$D:$D,'Breakdown & Project Funding'!F$15)+SUMIFS('3. Travel & Subsistence costs'!$R:$R,'3. Travel & Subsistence costs'!$E:$E,'Breakdown & Project Funding'!$B31,'3. Travel & Subsistence costs'!$D:$D,'Breakdown & Project Funding'!F$15)+SUMIFS('4. Personnel  costs'!$W:$W,'4. Personnel  costs'!$E:$E,'Breakdown & Project Funding'!$B31,'4. Personnel  costs'!$D:$D,'Breakdown & Project Funding'!F$15)+SUMIFS('5. Indirect Costs'!$J:$J,'5. Indirect Costs'!$E:$E,'Breakdown & Project Funding'!$B31,'5. Indirect Costs'!$D:$D,'Breakdown & Project Funding'!F$15)","v":0},{"$f":"SUMIFS('1. Costs linked to activities'!$K:$K,'1. Costs linked to activities'!$E:$E,$B31,'1. Costs linked to activities'!$D:$D,G$15)+SUMIFS('2. Communication Costs'!$K:$K,'2. Communication Costs'!$E:$E,'Breakdown & Project Funding'!$B31,'2. Communication Costs'!$D:$D,'Breakdown & Project Funding'!G$15)+SUMIFS('3. Travel & Subsistence costs'!$R:$R,'3. Travel & Subsistence costs'!$E:$E,'Breakdown & Project Funding'!$B31,'3. Travel & Subsistence costs'!$D:$D,'Breakdown & Project Funding'!G$15)+SUMIFS('4. Personnel  costs'!$W:$W,'4. Personnel  costs'!$E:$E,'Breakdown & Project Funding'!$B31,'4. Personnel  costs'!$D:$D,'Breakdown & Project Funding'!G$15)+SUMIFS('5. Indirect Costs'!$J:$J,'5. Indirect Costs'!$E:$E,'Breakdown & Project Funding'!$B31,'5. Indirect Costs'!$D:$D,'Breakdown & Project Funding'!G$15)","v":0},0]
[null,"P17",{"$f":"SUMIFS('1. Costs linked to activities'!$K:$K,'1. Costs linked to activities'!$E:$E,$B32,'1. Costs linked to activities'!$D:$D,C$15)+SUMIFS('2. Communication Costs'!$K:$K,'2. Communication Costs'!$E:$E,'Breakdown & Project Funding'!$B32,'2. Communication Costs'!$D:$D,'Breakdown & Project Funding'!C$15)+SUMIFS('3. Travel & Subsistence costs'!$R:$R,'3. Travel & Subsistence costs'!$E:$E,'Breakdown & Project Funding'!$B32,'3. Travel & Subsistence costs'!$D:$D,'Breakdown & Project Funding'!C$15)+SUMIFS('4. Personnel  costs'!$W:$W,'4. Personnel  costs'!$E:$E,'Breakdown & Project Funding'!$B32,'4. Personnel  costs'!$D:$D,'Breakdown & Project Funding'!C$15)+SUMIFS('5. Indirect Costs'!$J:$J,'5. Indirect Costs'!$E:$E,'Breakdown & Project Funding'!$B32,'5. Indirect Costs'!$D:$D,'Breakdown & Project Funding'!C$15)","v":0},{"$f":"SUMIFS('1. Costs linked to activities'!$K:$K,'1. Costs linked to activities'!$E:$E,$B32,'1. Costs linked to activities'!$D:$D,D$15)+SUMIFS('2. Communication Costs'!$K:$K,'2. Communication Costs'!$E:$E,'Breakdown & Project Funding'!$B32,'2. Communication Costs'!$D:$D,'Breakdown & Project Funding'!D$15)+SUMIFS('3. Travel & Subsistence costs'!$R:$R,'3. Travel & Subsistence costs'!$E:$E,'Breakdown & Project Funding'!$B32,'3. Travel & Subsistence costs'!$D:$D,'Breakdown & Project Funding'!D$15)+SUMIFS('4. Personnel  costs'!$W:$W,'4. Personnel  costs'!$E:$E,'Breakdown & Project Funding'!$B32,'4. Personnel  costs'!$D:$D,'Breakdown & Project Funding'!D$15)+SUMIFS('5. Indirect Costs'!$J:$J,'5. Indirect Costs'!$E:$E,'Breakdown & Project Funding'!$B32,'5. Indirect Costs'!$D:$D,'Breakdown & Project Funding'!D$15)","v":0},{"$f":"SUMIFS('1. Costs linked to activities'!$K:$K,'1. Costs linked to activities'!$E:$E,$B32,'1. Costs linked to activities'!$D:$D,E$15)+SUMIFS('2. Communication Costs'!$K:$K,'2. Communication Costs'!$E:$E,'Breakdown & Project Funding'!$B32,'2. Communication Costs'!$D:$D,'Breakdown & Project Funding'!E$15)+SUMIFS('3. Travel & Subsistence costs'!$R:$R,'3. Travel & Subsistence costs'!$E:$E,'Breakdown & Project Funding'!$B32,'3. Travel & Subsistence costs'!$D:$D,'Breakdown & Project Funding'!E$15)+SUMIFS('4. Personnel  costs'!$W:$W,'4. Personnel  costs'!$E:$E,'Breakdown & Project Funding'!$B32,'4. Personnel  costs'!$D:$D,'Breakdown & Project Funding'!E$15)+SUMIFS('5. Indirect Costs'!$J:$J,'5. Indirect Costs'!$E:$E,'Breakdown & Project Funding'!$B32,'5. Indirect Costs'!$D:$D,'Breakdown & Project Funding'!E$15)","v":0},{"$f":"SUMIFS('1. Costs linked to activities'!$K:$K,'1. Costs linked to activities'!$E:$E,$B32,'1. Costs linked to activities'!$D:$D,F$15)+SUMIFS('2. Communication Costs'!$K:$K,'2. Communication Costs'!$E:$E,'Breakdown & Project Funding'!$B32,'2. Communication Costs'!$D:$D,'Breakdown & Project Funding'!F$15)+SUMIFS('3. Travel & Subsistence costs'!$R:$R,'3. Travel & Subsistence costs'!$E:$E,'Breakdown & Project Funding'!$B32,'3. Travel & Subsistence costs'!$D:$D,'Breakdown & Project Funding'!F$15)+SUMIFS('4. Personnel  costs'!$W:$W,'4. Personnel  costs'!$E:$E,'Breakdown & Project Funding'!$B32,'4. Personnel  costs'!$D:$D,'Breakdown & Project Funding'!F$15)+SUMIFS('5. Indirect Costs'!$J:$J,'5. Indirect Costs'!$E:$E,'Breakdown & Project Funding'!$B32,'5. Indirect Costs'!$D:$D,'Breakdown & Project Funding'!F$15)","v":0},{"$f":"SUMIFS('1. Costs linked to activities'!$K:$K,'1. Costs linked to activities'!$E:$E,$B32,'1. Costs linked to activities'!$D:$D,G$15)+SUMIFS('2. Communication Costs'!$K:$K,'2. Communication Costs'!$E:$E,'Breakdown & Project Funding'!$B32,'2. Communication Costs'!$D:$D,'Breakdown & Project Funding'!G$15)+SUMIFS('3. Travel & Subsistence costs'!$R:$R,'3. Travel & Subsistence costs'!$E:$E,'Breakdown & Project Funding'!$B32,'3. Travel & Subsistence costs'!$D:$D,'Breakdown & Project Funding'!G$15)+SUMIFS('4. Personnel  costs'!$W:$W,'4. Personnel  costs'!$E:$E,'Breakdown & Project Funding'!$B32,'4. Personnel  costs'!$D:$D,'Breakdown & Project Funding'!G$15)+SUMIFS('5. Indirect Costs'!$J:$J,'5. Indirect Costs'!$E:$E,'Breakdown & Project Funding'!$B32,'5. Indirect Costs'!$D:$D,'Breakdown & Project Funding'!G$15)","v":0},0]
[null,"P18",{"$f":"SUMIFS('1. Costs linked to activities'!$K:$K,'1. Costs linked to activities'!$E:$E,$B33,'1. Costs linked to activities'!$D:$D,C$15)+SUMIFS('2. Communication Costs'!$K:$K,'2. Communication Costs'!$E:$E,'Breakdown & Project Funding'!$B33,'2. Communication Costs'!$D:$D,'Breakdown & Project Funding'!C$15)+SUMIFS('3. Travel & Subsistence costs'!$R:$R,'3. Travel & Subsistence costs'!$E:$E,'Breakdown & Project Funding'!$B33,'3. Travel & Subsistence costs'!$D:$D,'Breakdown & Project Funding'!C$15)+SUMIFS('4. Personnel  costs'!$W:$W,'4. Personnel  costs'!$E:$E,'Breakdown & Project Funding'!$B33,'4. Personnel  costs'!$D:$D,'Breakdown & Project Funding'!C$15)+SUMIFS('5. Indirect Costs'!$J:$J,'5. Indirect Costs'!$E:$E,'Breakdown & Project Funding'!$B33,'5. Indirect Costs'!$D:$D,'Breakdown & Project Funding'!C$15)","v":0},{"$f":"SUMIFS('1. Costs linked to activities'!$K:$K,'1. Costs linked to activities'!$E:$E,$B33,'1. Costs linked to activities'!$D:$D,D$15)+SUMIFS('2. Communication Costs'!$K:$K,'2. Communication Costs'!$E:$E,'Breakdown & Project Funding'!$B33,'2. Communication Costs'!$D:$D,'Breakdown & Project Funding'!D$15)+SUMIFS('3. Travel & Subsistence costs'!$R:$R,'3. Travel & Subsistence costs'!$E:$E,'Breakdown & Project Funding'!$B33,'3. Travel & Subsistence costs'!$D:$D,'Breakdown & Project Funding'!D$15)+SUMIFS('4. Personnel  costs'!$W:$W,'4. Personnel  costs'!$E:$E,'Breakdown & Project Funding'!$B33,'4. Personnel  costs'!$D:$D,'Breakdown & Project Funding'!D$15)+SUMIFS('5. Indirect Costs'!$J:$J,'5. Indirect Costs'!$E:$E,'Breakdown & Project Funding'!$B33,'5. Indirect Costs'!$D:$D,'Breakdown & Project Funding'!D$15)","v":0},{"$f":"SUMIFS('1. Costs linked to activities'!$K:$K,'1. Costs linked to activities'!$E:$E,$B33,'1. Costs linked to activities'!$D:$D,E$15)+SUMIFS('2. Communication Costs'!$K:$K,'2. Communication Costs'!$E:$E,'Breakdown & Project Funding'!$B33,'2. Communication Costs'!$D:$D,'Breakdown & Project Funding'!E$15)+SUMIFS('3. Travel & Subsistence costs'!$R:$R,'3. Travel & Subsistence costs'!$E:$E,'Breakdown & Project Funding'!$B33,'3. Travel & Subsistence costs'!$D:$D,'Breakdown & Project Funding'!E$15)+SUMIFS('4. Personnel  costs'!$W:$W,'4. Personnel  costs'!$E:$E,'Breakdown & Project Funding'!$B33,'4. Personnel  costs'!$D:$D,'Breakdown & Project Funding'!E$15)+SUMIFS('5. Indirect Costs'!$J:$J,'5. Indirect Costs'!$E:$E,'Breakdown & Project Funding'!$B33,'5. Indirect Costs'!$D:$D,'Breakdown & Project Funding'!E$15)","v":0},{"$f":"SUMIFS('1. Costs linked to activities'!$K:$K,'1. Costs linked to activities'!$E:$E,$B33,'1. Costs linked to activities'!$D:$D,F$15)+SUMIFS('2. Communication Costs'!$K:$K,'2. Communication Costs'!$E:$E,'Breakdown & Project Funding'!$B33,'2. Communication Costs'!$D:$D,'Breakdown & Project Funding'!F$15)+SUMIFS('3. Travel & Subsistence costs'!$R:$R,'3. Travel & Subsistence costs'!$E:$E,'Breakdown & Project Funding'!$B33,'3. Travel & Subsistence costs'!$D:$D,'Breakdown & Project Funding'!F$15)+SUMIFS('4. Personnel  costs'!$W:$W,'4. Personnel  costs'!$E:$E,'Breakdown & Project Funding'!$B33,'4. Personnel  costs'!$D:$D,'Breakdown & Project Funding'!F$15)+SUMIFS('5. Indirect Costs'!$J:$J,'5. Indirect Costs'!$E:$E,'Breakdown & Project Funding'!$B33,'5. Indirect Costs'!$D:$D,'Breakdown & Project Funding'!F$15)","v":0},{"$f":"SUMIFS('1. Costs linked to activities'!$K:$K,'1. Costs linked to activities'!$E:$E,$B33,'1. Costs linked to activities'!$D:$D,G$15)+SUMIFS('2. Communication Costs'!$K:$K,'2. Communication Costs'!$E:$E,'Breakdown & Project Funding'!$B33,'2. Communication Costs'!$D:$D,'Breakdown & Project Funding'!G$15)+SUMIFS('3. Travel & Subsistence costs'!$R:$R,'3. Travel & Subsistence costs'!$E:$E,'Breakdown & Project Funding'!$B33,'3. Travel & Subsistence costs'!$D:$D,'Breakdown & Project Funding'!G$15)+SUMIFS('4. Personnel  costs'!$W:$W,'4. Personnel  costs'!$E:$E,'Breakdown & Project Funding'!$B33,'4. Personnel  costs'!$D:$D,'Breakdown & Project Funding'!G$15)+SUMIFS('5. Indirect Costs'!$J:$J,'5. Indirect Costs'!$E:$E,'Breakdown & Project Funding'!$B33,'5. Indirect Costs'!$D:$D,'Breakdown & Project Funding'!G$15)","v":0},0]
[null,"P19",{"$f":"SUMIFS('1. Costs linked to activities'!$K:$K,'1. Costs linked to activities'!$E:$E,$B34,'1. Costs linked to activities'!$D:$D,C$15)+SUMIFS('2. Communication Costs'!$K:$K,'2. Communication Costs'!$E:$E,'Breakdown & Project Funding'!$B34,'2. Communication Costs'!$D:$D,'Breakdown & Project Funding'!C$15)+SUMIFS('3. Travel & Subsistence costs'!$R:$R,'3. Travel & Subsistence costs'!$E:$E,'Breakdown & Project Funding'!$B34,'3. Travel & Subsistence costs'!$D:$D,'Breakdown & Project Funding'!C$15)+SUMIFS('4. Personnel  costs'!$W:$W,'4. Personnel  costs'!$E:$E,'Breakdown & Project Funding'!$B34,'4. Personnel  costs'!$D:$D,'Breakdown & Project Funding'!C$15)+SUMIFS('5. Indirect Costs'!$J:$J,'5. Indirect Costs'!$E:$E,'Breakdown & Project Funding'!$B34,'5. Indirect Costs'!$D:$D,'Breakdown & Project Funding'!C$15)","v":0},{"$f":"SUMIFS('1. Costs linked to activities'!$K:$K,'1. Costs linked to activities'!$E:$E,$B34,'1. Costs linked to activities'!$D:$D,D$15)+SUMIFS('2. Communication Costs'!$K:$K,'2. Communication Costs'!$E:$E,'Breakdown & Project Funding'!$B34,'2. Communication Costs'!$D:$D,'Breakdown & Project Funding'!D$15)+SUMIFS('3. Travel & Subsistence costs'!$R:$R,'3. Travel & Subsistence costs'!$E:$E,'Breakdown & Project Funding'!$B34,'3. Travel & Subsistence costs'!$D:$D,'Breakdown & Project Funding'!D$15)+SUMIFS('4. Personnel  costs'!$W:$W,'4. Personnel  costs'!$E:$E,'Breakdown & Project Funding'!$B34,'4. Personnel  costs'!$D:$D,'Breakdown & Project Funding'!D$15)+SUMIFS('5. Indirect Costs'!$J:$J,'5. Indirect Costs'!$E:$E,'Breakdown & Project Funding'!$B34,'5. Indirect Costs'!$D:$D,'Breakdown & Project Funding'!D$15)","v":0},{"$f":"SUMIFS('1. Costs linked to activities'!$K:$K,'1. Costs linked to activities'!$E:$E,$B34,'1. Costs linked to activities'!$D:$D,E$15)+SUMIFS('2. Communication Costs'!$K:$K,'2. Communication Costs'!$E:$E,'Breakdown & Project Funding'!$B34,'2. Communication Costs'!$D:$D,'Breakdown & Project Funding'!E$15)+SUMIFS('3. Travel & Subsistence costs'!$R:$R,'3. Travel & Subsistence costs'!$E:$E,'Breakdown & Project Funding'!$B34,'3. Travel & Subsistence costs'!$D:$D,'Breakdown & Project Funding'!E$15)+SUMIFS('4. Personnel  costs'!$W:$W,'4. Personnel  costs'!$E:$E,'Breakdown & Project Funding'!$B34,'4. Personnel  costs'!$D:$D,'Breakdown & Project Funding'!E$15)+SUMIFS('5. Indirect Costs'!$J:$J,'5. Indirect Costs'!$E:$E,'Breakdown & Project Funding'!$B34,'5. Indirect Costs'!$D:$D,'Breakdown & Project Funding'!E$15)","v":0},{"$f":"SUMIFS('1. Costs linked to activities'!$K:$K,'1. Costs linked to activities'!$E:$E,$B34,'1. Costs linked to activities'!$D:$D,F$15)+SUMIFS('2. Communication Costs'!$K:$K,'2. Communication Costs'!$E:$E,'Breakdown & Project Funding'!$B34,'2. Communication Costs'!$D:$D,'Breakdown & Project Funding'!F$15)+SUMIFS('3. Travel & Subsistence costs'!$R:$R,'3. Travel & Subsistence costs'!$E:$E,'Breakdown & Project Funding'!$B34,'3. Travel & Subsistence costs'!$D:$D,'Breakdown & Project Funding'!F$15)+SUMIFS('4. Personnel  costs'!$W:$W,'4. Personnel  costs'!$E:$E,'Breakdown & Project Funding'!$B34,'4. Personnel  costs'!$D:$D,'Breakdown & Project Funding'!F$15)+SUMIFS('5. Indirect Costs'!$J:$J,'5. Indirect Costs'!$E:$E,'Breakdown & Project Funding'!$B34,'5. Indirect Costs'!$D:$D,'Breakdown & Project Funding'!F$15)","v":0},{"$f":"SUMIFS('1. Costs linked to activities'!$K:$K,'1. Costs linked to activities'!$E:$E,$B34,'1. Costs linked to activities'!$D:$D,G$15)+SUMIFS('2. Communication Costs'!$K:$K,'2. Communication Costs'!$E:$E,'Breakdown & Project Funding'!$B34,'2. Communication Costs'!$D:$D,'Breakdown & Project Funding'!G$15)+SUMIFS('3. Travel & Subsistence costs'!$R:$R,'3. Travel & Subsistence costs'!$E:$E,'Breakdown & Project Funding'!$B34,'3. Travel & Subsistence costs'!$D:$D,'Breakdown & Project Funding'!G$15)+SUMIFS('4. Personnel  costs'!$W:$W,'4. Personnel  costs'!$E:$E,'Breakdown & Project Funding'!$B34,'4. Personnel  costs'!$D:$D,'Breakdown & Project Funding'!G$15)+SUMIFS('5. Indirect Costs'!$J:$J,'5. Indirect Costs'!$E:$E,'Breakdown & Project Funding'!$B34,'5. Indirect Costs'!$D:$D,'Breakdown & Project Funding'!G$15)","v":0},0]
[null,"P20",{"$f":"SUMIFS('1. Costs linked to activities'!$K:$K,'1. Costs linked to activities'!$E:$E,$B35,'1. Costs linked to activities'!$D:$D,C$15)+SUMIFS('2. Communication Costs'!$K:$K,'2. Communication Costs'!$E:$E,'Breakdown & Project Funding'!$B35,'2. Communication Costs'!$D:$D,'Breakdown & Project Funding'!C$15)+SUMIFS('3. Travel & Subsistence costs'!$R:$R,'3. Travel & Subsistence costs'!$E:$E,'Breakdown & Project Funding'!$B35,'3. Travel & Subsistence costs'!$D:$D,'Breakdown & Project Funding'!C$15)+SUMIFS('4. Personnel  costs'!$W:$W,'4. Personnel  costs'!$E:$E,'Breakdown & Project Funding'!$B35,'4. Personnel  costs'!$D:$D,'Breakdown & Project Funding'!C$15)+SUMIFS('5. Indirect Costs'!$J:$J,'5. Indirect Costs'!$E:$E,'Breakdown & Project Funding'!$B35,'5. Indirect Costs'!$D:$D,'Breakdown & Project Funding'!C$15)","v":0},{"$f":"SUMIFS('1. Costs linked to activities'!$K:$K,'1. Costs linked to activities'!$E:$E,$B35,'1. Costs linked to activities'!$D:$D,D$15)+SUMIFS('2. Communication Costs'!$K:$K,'2. Communication Costs'!$E:$E,'Breakdown & Project Funding'!$B35,'2. Communication Costs'!$D:$D,'Breakdown & Project Funding'!D$15)+SUMIFS('3. Travel & Subsistence costs'!$R:$R,'3. Travel & Subsistence costs'!$E:$E,'Breakdown & Project Funding'!$B35,'3. Travel & Subsistence costs'!$D:$D,'Breakdown & Project Funding'!D$15)+SUMIFS('4. Personnel  costs'!$W:$W,'4. Personnel  costs'!$E:$E,'Breakdown & Project Funding'!$B35,'4. Personnel  costs'!$D:$D,'Breakdown & Project Funding'!D$15)+SUMIFS('5. Indirect Costs'!$J:$J,'5. Indirect Costs'!$E:$E,'Breakdown & Project Funding'!$B35,'5. Indirect Costs'!$D:$D,'Breakdown & Project Funding'!D$15)","v":0},{"$f":"SUMIFS('1. Costs linked to activities'!$K:$K,'1. Costs linked to activities'!$E:$E,$B35,'1. Costs linked to activities'!$D:$D,E$15)+SUMIFS('2. Communication Costs'!$K:$K,'2. Communication Costs'!$E:$E,'Breakdown & Project Funding'!$B35,'2. Communication Costs'!$D:$D,'Breakdown & Project Funding'!E$15)+SUMIFS('3. Travel & Subsistence costs'!$R:$R,'3. Travel & Subsistence costs'!$E:$E,'Breakdown & Project Funding'!$B35,'3. Travel & Subsistence costs'!$D:$D,'Breakdown & Project Funding'!E$15)+SUMIFS('4. Personnel  costs'!$W:$W,'4. Personnel  costs'!$E:$E,'Breakdown & Project Funding'!$B35,'4. Personnel  costs'!$D:$D,'Breakdown & Project Funding'!E$15)+SUMIFS('5. Indirect Costs'!$J:$J,'5. Indirect Costs'!$E:$E,'Breakdown & Project Funding'!$B35,'5. Indirect Costs'!$D:$D,'Breakdown & Project Funding'!E$15)","v":0},{"$f":"SUMIFS('1. Costs linked to activities'!$K:$K,'1. Costs linked to activities'!$E:$E,$B35,'1. Costs linked to activities'!$D:$D,F$15)+SUMIFS('2. Communication Costs'!$K:$K,'2. Communication Costs'!$E:$E,'Breakdown & Project Funding'!$B35,'2. Communication Costs'!$D:$D,'Breakdown & Project Funding'!F$15)+SUMIFS('3. Travel & Subsistence costs'!$R:$R,'3. Travel & Subsistence costs'!$E:$E,'Breakdown & Project Funding'!$B35,'3. Travel & Subsistence costs'!$D:$D,'Breakdown & Project Funding'!F$15)+SUMIFS('4. Personnel  costs'!$W:$W,'4. Personnel  costs'!$E:$E,'Breakdown & Project Funding'!$B35,'4. Personnel  costs'!$D:$D,'Breakdown & Project Funding'!F$15)+SUMIFS('5. Indirect Costs'!$J:$J,'5. Indirect Costs'!$E:$E,'Breakdown & Project Funding'!$B35,'5. Indirect Costs'!$D:$D,'Breakdown & Project Funding'!F$15)","v":0},{"$f":"SUMIFS('1. Costs linked to activities'!$K:$K,'1. Costs linked to activities'!$E:$E,$B35,'1. Costs linked to activities'!$D:$D,G$15)+SUMIFS('2. Communication Costs'!$K:$K,'2. Communication Costs'!$E:$E,'Breakdown & Project Funding'!$B35,'2. Communication Costs'!$D:$D,'Breakdown & Project Funding'!G$15)+SUMIFS('3. Travel & Subsistence costs'!$R:$R,'3. Travel & Subsistence costs'!$E:$E,'Breakdown & Project Funding'!$B35,'3. Travel & Subsistence costs'!$D:$D,'Breakdown & Project Funding'!G$15)+SUMIFS('4. Personnel  costs'!$W:$W,'4. Personnel  costs'!$E:$E,'Breakdown & Project Funding'!$B35,'4. Personnel  costs'!$D:$D,'Breakdown & Project Funding'!G$15)+SUMIFS('5. Indirect Costs'!$J:$J,'5. Indirect Costs'!$E:$E,'Breakdown & Project Funding'!$B35,'5. Indirect Costs'!$D:$D,'Breakdown & Project Funding'!G$15)","v":0},0]
[null,"P21",{"$f":"SUMIFS('1. Costs linked to activities'!$K:$K,'1. Costs linked to activities'!$E:$E,$B36,'1. Costs linked to activities'!$D:$D,C$15)+SUMIFS('2. Communication Costs'!$K:$K,'2. Communication Costs'!$E:$E,'Breakdown & Project Funding'!$B36,'2. Communication Costs'!$D:$D,'Breakdown & Project Funding'!C$15)+SUMIFS('3. Travel & Subsistence costs'!$R:$R,'3. Travel & Subsistence costs'!$E:$E,'Breakdown & Project Funding'!$B36,'3. Travel & Subsistence costs'!$D:$D,'Breakdown & Project Funding'!C$15)+SUMIFS('4. Personnel  costs'!$W:$W,'4. Personnel  costs'!$E:$E,'Breakdown & Project Funding'!$B36,'4. Personnel  costs'!$D:$D,'Breakdown & Project Funding'!C$15)+SUMIFS('5. Indirect Costs'!$J:$J,'5. Indirect Costs'!$E:$E,'Breakdown & Project Funding'!$B36,'5. Indirect Costs'!$D:$D,'Breakdown & Project Funding'!C$15)","v":0},{"$f":"SUMIFS('1. Costs linked to activities'!$K:$K,'1. Costs linked to activities'!$E:$E,$B36,'1. Costs linked to activities'!$D:$D,D$15)+SUMIFS('2. Communication Costs'!$K:$K,'2. Communication Costs'!$E:$E,'Breakdown & Project Funding'!$B36,'2. Communication Costs'!$D:$D,'Breakdown & Project Funding'!D$15)+SUMIFS('3. Travel & Subsistence costs'!$R:$R,'3. Travel & Subsistence costs'!$E:$E,'Breakdown & Project Funding'!$B36,'3. Travel & Subsistence costs'!$D:$D,'Breakdown & Project Funding'!D$15)+SUMIFS('4. Personnel  costs'!$W:$W,'4. Personnel  costs'!$E:$E,'Breakdown & Project Funding'!$B36,'4. Personnel  costs'!$D:$D,'Breakdown & Project Funding'!D$15)+SUMIFS('5. Indirect Costs'!$J:$J,'5. Indirect Costs'!$E:$E,'Breakdown & Project Funding'!$B36,'5. Indirect Costs'!$D:$D,'Breakdown & Project Funding'!D$15)","v":0},{"$f":"SUMIFS('1. Costs linked to activities'!$K:$K,'1. Costs linked to activities'!$E:$E,$B36,'1. Costs linked to activities'!$D:$D,E$15)+SUMIFS('2. Communication Costs'!$K:$K,'2. Communication Costs'!$E:$E,'Breakdown & Project Funding'!$B36,'2. Communication Costs'!$D:$D,'Breakdown & Project Funding'!E$15)+SUMIFS('3. Travel & Subsistence costs'!$R:$R,'3. Travel & Subsistence costs'!$E:$E,'Breakdown & Project Funding'!$B36,'3. Travel & Subsistence costs'!$D:$D,'Breakdown & Project Funding'!E$15)+SUMIFS('4. Personnel  costs'!$W:$W,'4. Personnel  costs'!$E:$E,'Breakdown & Project Funding'!$B36,'4. Personnel  costs'!$D:$D,'Breakdown & Project Funding'!E$15)+SUMIFS('5. Indirect Costs'!$J:$J,'5. Indirect Costs'!$E:$E,'Breakdown & Project Funding'!$B36,'5. Indirect Costs'!$D:$D,'Breakdown & Project Funding'!E$15)","v":0},{"$f":"SUMIFS('1. Costs linked to activities'!$K:$K,'1. Costs linked to activities'!$E:$E,$B36,'1. Costs linked to activities'!$D:$D,F$15)+SUMIFS('2. Communication Costs'!$K:$K,'2. Communication Costs'!$E:$E,'Breakdown & Project Funding'!$B36,'2. Communication Costs'!$D:$D,'Breakdown & Project Funding'!F$15)+SUMIFS('3. Travel & Subsistence costs'!$R:$R,'3. Travel & Subsistence costs'!$E:$E,'Breakdown & Project Funding'!$B36,'3. Travel & Subsistence costs'!$D:$D,'Breakdown & Project Funding'!F$15)+SUMIFS('4. Personnel  costs'!$W:$W,'4. Personnel  costs'!$E:$E,'Breakdown & Project Funding'!$B36,'4. Personnel  costs'!$D:$D,'Breakdown & Project Funding'!F$15)+SUMIFS('5. Indirect Costs'!$J:$J,'5. Indirect Costs'!$E:$E,'Breakdown & Project Funding'!$B36,'5. Indirect Costs'!$D:$D,'Breakdown & Project Funding'!F$15)","v":0},{"$f":"SUMIFS('1. Costs linked to activities'!$K:$K,'1. Costs linked to activities'!$E:$E,$B36,'1. Costs linked to activities'!$D:$D,G$15)+SUMIFS('2. Communication Costs'!$K:$K,'2. Communication Costs'!$E:$E,'Breakdown & Project Funding'!$B36,'2. Communication Costs'!$D:$D,'Breakdown & Project Funding'!G$15)+SUMIFS('3. Travel & Subsistence costs'!$R:$R,'3. Travel & Subsistence costs'!$E:$E,'Breakdown & Project Funding'!$B36,'3. Travel & Subsistence costs'!$D:$D,'Breakdown & Project Funding'!G$15)+SUMIFS('4. Personnel  costs'!$W:$W,'4. Personnel  costs'!$E:$E,'Breakdown & Project Funding'!$B36,'4. Personnel  costs'!$D:$D,'Breakdown & Project Funding'!G$15)+SUMIFS('5. Indirect Costs'!$J:$J,'5. Indirect Costs'!$E:$E,'Breakdown & Project Funding'!$B36,'5. Indirect Costs'!$D:$D,'Breakdown & Project Funding'!G$15)","v":0},0]
[null,"P22",{"$f":"SUMIFS('1. Costs linked to activities'!$K:$K,'1. Costs linked to activities'!$E:$E,$B37,'1. Costs linked to activities'!$D:$D,C$15)+SUMIFS('2. Communication Costs'!$K:$K,'2. Communication Costs'!$E:$E,'Breakdown & Project Funding'!$B37,'2. Communication Costs'!$D:$D,'Breakdown & Project Funding'!C$15)+SUMIFS('3. Travel & Subsistence costs'!$R:$R,'3. Travel & Subsistence costs'!$E:$E,'Breakdown & Project Funding'!$B37,'3. Travel & Subsistence costs'!$D:$D,'Breakdown & Project Funding'!C$15)+SUMIFS('4. Personnel  costs'!$W:$W,'4. Personnel  costs'!$E:$E,'Breakdown & Project Funding'!$B37,'4. Personnel  costs'!$D:$D,'Breakdown & Project Funding'!C$15)+SUMIFS('5. Indirect Costs'!$J:$J,'5. Indirect Costs'!$E:$E,'Breakdown & Project Funding'!$B37,'5. Indirect Costs'!$D:$D,'Breakdown & Project Funding'!C$15)","v":0},{"$f":"SUMIFS('1. Costs linked to activities'!$K:$K,'1. Costs linked to activities'!$E:$E,$B37,'1. Costs linked to activities'!$D:$D,D$15)+SUMIFS('2. Communication Costs'!$K:$K,'2. Communication Costs'!$E:$E,'Breakdown & Project Funding'!$B37,'2. Communication Costs'!$D:$D,'Breakdown & Project Funding'!D$15)+SUMIFS('3. Travel & Subsistence costs'!$R:$R,'3. Travel & Subsistence costs'!$E:$E,'Breakdown & Project Funding'!$B37,'3. Travel & Subsistence costs'!$D:$D,'Breakdown & Project Funding'!D$15)+SUMIFS('4. Personnel  costs'!$W:$W,'4. Personnel  costs'!$E:$E,'Breakdown & Project Funding'!$B37,'4. Personnel  costs'!$D:$D,'Breakdown & Project Funding'!D$15)+SUMIFS('5. Indirect Costs'!$J:$J,'5. Indirect Costs'!$E:$E,'Breakdown & Project Funding'!$B37,'5. Indirect Costs'!$D:$D,'Breakdown & Project Funding'!D$15)","v":0},{"$f":"SUMIFS('1. Costs linked to activities'!$K:$K,'1. Costs linked to activities'!$E:$E,$B37,'1. Costs linked to activities'!$D:$D,E$15)+SUMIFS('2. Communication Costs'!$K:$K,'2. Communication Costs'!$E:$E,'Breakdown & Project Funding'!$B37,'2. Communication Costs'!$D:$D,'Breakdown & Project Funding'!E$15)+SUMIFS('3. Travel & Subsistence costs'!$R:$R,'3. Travel & Subsistence costs'!$E:$E,'Breakdown & Project Funding'!$B37,'3. Travel & Subsistence costs'!$D:$D,'Breakdown & Project Funding'!E$15)+SUMIFS('4. Personnel  costs'!$W:$W,'4. Personnel  costs'!$E:$E,'Breakdown & Project Funding'!$B37,'4. Personnel  costs'!$D:$D,'Breakdown & Project Funding'!E$15)+SUMIFS('5. Indirect Costs'!$J:$J,'5. Indirect Costs'!$E:$E,'Breakdown & Project Funding'!$B37,'5. Indirect Costs'!$D:$D,'Breakdown & Project Funding'!E$15)","v":0},{"$f":"SUMIFS('1. Costs linked to activities'!$K:$K,'1. Costs linked to activities'!$E:$E,$B37,'1. Costs linked to activities'!$D:$D,F$15)+SUMIFS('2. Communication Costs'!$K:$K,'2. Communication Costs'!$E:$E,'Breakdown & Project Funding'!$B37,'2. Communication Costs'!$D:$D,'Breakdown & Project Funding'!F$15)+SUMIFS('3. Travel & Subsistence costs'!$R:$R,'3. Travel & Subsistence costs'!$E:$E,'Breakdown & Project Funding'!$B37,'3. Travel & Subsistence costs'!$D:$D,'Breakdown & Project Funding'!F$15)+SUMIFS('4. Personnel  costs'!$W:$W,'4. Personnel  costs'!$E:$E,'Breakdown & Project Funding'!$B37,'4. Personnel  costs'!$D:$D,'Breakdown & Project Funding'!F$15)+SUMIFS('5. Indirect Costs'!$J:$J,'5. Indirect Costs'!$E:$E,'Breakdown & Project Funding'!$B37,'5. Indirect Costs'!$D:$D,'Breakdown & Project Funding'!F$15)","v":0},{"$f":"SUMIFS('1. Costs linked to activities'!$K:$K,'1. Costs linked to activities'!$E:$E,$B37,'1. Costs linked to activities'!$D:$D,G$15)+SUMIFS('2. Communication Costs'!$K:$K,'2. Communication Costs'!$E:$E,'Breakdown & Project Funding'!$B37,'2. Communication Costs'!$D:$D,'Breakdown & Project Funding'!G$15)+SUMIFS('3. Travel & Subsistence costs'!$R:$R,'3. Travel & Subsistence costs'!$E:$E,'Breakdown & Project Funding'!$B37,'3. Travel & Subsistence costs'!$D:$D,'Breakdown & Project Funding'!G$15)+SUMIFS('4. Personnel  costs'!$W:$W,'4. Personnel  costs'!$E:$E,'Breakdown & Project Funding'!$B37,'4. Personnel  costs'!$D:$D,'Breakdown & Project Funding'!G$15)+SUMIFS('5. Indirect Costs'!$J:$J,'5. Indirect Costs'!$E:$E,'Breakdown & Project Funding'!$B37,'5. Indirect Costs'!$D:$D,'Breakdown & Project Funding'!G$15)","v":0},0]
[null,"P23",{"$f":"SUMIFS('1. Costs linked to activities'!$K:$K,'1. Costs linked to activities'!$E:$E,$B38,'1. Costs linked to activities'!$D:$D,C$15)+SUMIFS('2. Communication Costs'!$K:$K,'2. Communication Costs'!$E:$E,'Breakdown & Project Funding'!$B38,'2. Communication Costs'!$D:$D,'Breakdown & Project Funding'!C$15)+SUMIFS('3. Travel & Subsistence costs'!$R:$R,'3. Travel & Subsistence costs'!$E:$E,'Breakdown & Project Funding'!$B38,'3. Travel & Subsistence costs'!$D:$D,'Breakdown & Project Funding'!C$15)+SUMIFS('4. Personnel  costs'!$W:$W,'4. Personnel  costs'!$E:$E,'Breakdown & Project Funding'!$B38,'4. Personnel  costs'!$D:$D,'Breakdown & Project Funding'!C$15)+SUMIFS('5. Indirect Costs'!$J:$J,'5. Indirect Costs'!$E:$E,'Breakdown & Project Funding'!$B38,'5. Indirect Costs'!$D:$D,'Breakdown & Project Funding'!C$15)","v":0},{"$f":"SUMIFS('1. Costs linked to activities'!$K:$K,'1. Costs linked to activities'!$E:$E,$B38,'1. Costs linked to activities'!$D:$D,D$15)+SUMIFS('2. Communication Costs'!$K:$K,'2. Communication Costs'!$E:$E,'Breakdown & Project Funding'!$B38,'2. Communication Costs'!$D:$D,'Breakdown & Project Funding'!D$15)+SUMIFS('3. Travel & Subsistence costs'!$R:$R,'3. Travel & Subsistence costs'!$E:$E,'Breakdown & Project Funding'!$B38,'3. Travel & Subsistence costs'!$D:$D,'Breakdown & Project Funding'!D$15)+SUMIFS('4. Personnel  costs'!$W:$W,'4. Personnel  costs'!$E:$E,'Breakdown & Project Funding'!$B38,'4. Personnel  costs'!$D:$D,'Breakdown & Project Funding'!D$15)+SUMIFS('5. Indirect Costs'!$J:$J,'5. Indirect Costs'!$E:$E,'Breakdown & Project Funding'!$B38,'5. Indirect Costs'!$D:$D,'Breakdown & Project Funding'!D$15)","v":0},{"$f":"SUMIFS('1. Costs linked to activities'!$K:$K,'1. Costs linked to activities'!$E:$E,$B38,'1. Costs linked to activities'!$D:$D,E$15)+SUMIFS('2. Communication Costs'!$K:$K,'2. Communication Costs'!$E:$E,'Breakdown & Project Funding'!$B38,'2. Communication Costs'!$D:$D,'Breakdown & Project Funding'!E$15)+SUMIFS('3. Travel & Subsistence costs'!$R:$R,'3. Travel & Subsistence costs'!$E:$E,'Breakdown & Project Funding'!$B38,'3. Travel & Subsistence costs'!$D:$D,'Breakdown & Project Funding'!E$15)+SUMIFS('4. Personnel  costs'!$W:$W,'4. Personnel  costs'!$E:$E,'Breakdown & Project Funding'!$B38,'4. Personnel  costs'!$D:$D,'Breakdown & Project Funding'!E$15)+SUMIFS('5. Indirect Costs'!$J:$J,'5. Indirect Costs'!$E:$E,'Breakdown & Project Funding'!$B38,'5. Indirect Costs'!$D:$D,'Breakdown & Project Funding'!E$15)","v":0},{"$f":"SUMIFS('1. Costs linked to activities'!$K:$K,'1. Costs linked to activities'!$E:$E,$B38,'1. Costs linked to activities'!$D:$D,F$15)+SUMIFS('2. Communication Costs'!$K:$K,'2. Communication Costs'!$E:$E,'Breakdown & Project Funding'!$B38,'2. Communication Costs'!$D:$D,'Breakdown & Project Funding'!F$15)+SUMIFS('3. Travel & Subsistence costs'!$R:$R,'3. Travel & Subsistence costs'!$E:$E,'Breakdown & Project Funding'!$B38,'3. Travel & Subsistence costs'!$D:$D,'Breakdown & Project Funding'!F$15)+SUMIFS('4. Personnel  costs'!$W:$W,'4. Personnel  costs'!$E:$E,'Breakdown & Project Funding'!$B38,'4. Personnel  costs'!$D:$D,'Breakdown & Project Funding'!F$15)+SUMIFS('5. Indirect Costs'!$J:$J,'5. Indirect Costs'!$E:$E,'Breakdown & Project Funding'!$B38,'5. Indirect Costs'!$D:$D,'Breakdown & Project Funding'!F$15)","v":0},{"$f":"SUMIFS('1. Costs linked to activities'!$K:$K,'1. Costs linked to activities'!$E:$E,$B38,'1. Costs linked to activities'!$D:$D,G$15)+SUMIFS('2. Communication Costs'!$K:$K,'2. Communication Costs'!$E:$E,'Breakdown & Project Funding'!$B38,'2. Communication Costs'!$D:$D,'Breakdown & Project Funding'!G$15)+SUMIFS('3. Travel & Subsistence costs'!$R:$R,'3. Travel & Subsistence costs'!$E:$E,'Breakdown & Project Funding'!$B38,'3. Travel & Subsistence costs'!$D:$D,'Breakdown & Project Funding'!G$15)+SUMIFS('4. Personnel  costs'!$W:$W,'4. Personnel  costs'!$E:$E,'Breakdown & Project Funding'!$B38,'4. Personnel  costs'!$D:$D,'Breakdown & Project Funding'!G$15)+SUMIFS('5. Indirect Costs'!$J:$J,'5. Indirect Costs'!$E:$E,'Breakdown & Project Funding'!$B38,'5. Indirect Costs'!$D:$D,'Breakdown & Project Funding'!G$15)","v":0},0]
[null,"P24",{"$f":"SUMIFS('1. Costs linked to activities'!$K:$K,'1. Costs linked to activities'!$E:$E,$B39,'1. Costs linked to activities'!$D:$D,C$15)+SUMIFS('2. Communication Costs'!$K:$K,'2. Communication Costs'!$E:$E,'Breakdown & Project Funding'!$B39,'2. Communication Costs'!$D:$D,'Breakdown & Project Funding'!C$15)+SUMIFS('3. Travel & Subsistence costs'!$R:$R,'3. Travel & Subsistence costs'!$E:$E,'Breakdown & Project Funding'!$B39,'3. Travel & Subsistence costs'!$D:$D,'Breakdown & Project Funding'!C$15)+SUMIFS('4. Personnel  costs'!$W:$W,'4. Personnel  costs'!$E:$E,'Breakdown & Project Funding'!$B39,'4. Personnel  costs'!$D:$D,'Breakdown & Project Funding'!C$15)+SUMIFS('5. Indirect Costs'!$J:$J,'5. Indirect Costs'!$E:$E,'Breakdown & Project Funding'!$B39,'5. Indirect Costs'!$D:$D,'Breakdown & Project Funding'!C$15)","v":0},{"$f":"SUMIFS('1. Costs linked to activities'!$K:$K,'1. Costs linked to activities'!$E:$E,$B39,'1. Costs linked to activities'!$D:$D,D$15)+SUMIFS('2. Communication Costs'!$K:$K,'2. Communication Costs'!$E:$E,'Breakdown & Project Funding'!$B39,'2. Communication Costs'!$D:$D,'Breakdown & Project Funding'!D$15)+SUMIFS('3. Travel & Subsistence costs'!$R:$R,'3. Travel & Subsistence costs'!$E:$E,'Breakdown & Project Funding'!$B39,'3. Travel & Subsistence costs'!$D:$D,'Breakdown & Project Funding'!D$15)+SUMIFS('4. Personnel  costs'!$W:$W,'4. Personnel  costs'!$E:$E,'Breakdown & Project Funding'!$B39,'4. Personnel  costs'!$D:$D,'Breakdown & Project Funding'!D$15)+SUMIFS('5. Indirect Costs'!$J:$J,'5. Indirect Costs'!$E:$E,'Breakdown & Project Funding'!$B39,'5. Indirect Costs'!$D:$D,'Breakdown & Project Funding'!D$15)","v":0},{"$f":"SUMIFS('1. Costs linked to activities'!$K:$K,'1. Costs linked to activities'!$E:$E,$B39,'1. Costs linked to activities'!$D:$D,E$15)+SUMIFS('2. Communication Costs'!$K:$K,'2. Communication Costs'!$E:$E,'Breakdown & Project Funding'!$B39,'2. Communication Costs'!$D:$D,'Breakdown & Project Funding'!E$15)+SUMIFS('3. Travel & Subsistence costs'!$R:$R,'3. Travel & Subsistence costs'!$E:$E,'Breakdown & Project Funding'!$B39,'3. Travel & Subsistence costs'!$D:$D,'Breakdown & Project Funding'!E$15)+SUMIFS('4. Personnel  costs'!$W:$W,'4. Personnel  costs'!$E:$E,'Breakdown & Project Funding'!$B39,'4. Personnel  costs'!$D:$D,'Breakdown & Project Funding'!E$15)+SUMIFS('5. Indirect Costs'!$J:$J,'5. Indirect Costs'!$E:$E,'Breakdown & Project Funding'!$B39,'5. Indirect Costs'!$D:$D,'Breakdown & Project Funding'!E$15)","v":0},{"$f":"SUMIFS('1. Costs linked to activities'!$K:$K,'1. Costs linked to activities'!$E:$E,$B39,'1. Costs linked to activities'!$D:$D,F$15)+SUMIFS('2. Communication Costs'!$K:$K,'2. Communication Costs'!$E:$E,'Breakdown & Project Funding'!$B39,'2. Communication Costs'!$D:$D,'Breakdown & Project Funding'!F$15)+SUMIFS('3. Travel & Subsistence costs'!$R:$R,'3. Travel & Subsistence costs'!$E:$E,'Breakdown & Project Funding'!$B39,'3. Travel & Subsistence costs'!$D:$D,'Breakdown & Project Funding'!F$15)+SUMIFS('4. Personnel  costs'!$W:$W,'4. Personnel  costs'!$E:$E,'Breakdown & Project Funding'!$B39,'4. Personnel  costs'!$D:$D,'Breakdown & Project Funding'!F$15)+SUMIFS('5. Indirect Costs'!$J:$J,'5. Indirect Costs'!$E:$E,'Breakdown & Project Funding'!$B39,'5. Indirect Costs'!$D:$D,'Breakdown & Project Funding'!F$15)","v":0},{"$f":"SUMIFS('1. Costs linked to activities'!$K:$K,'1. Costs linked to activities'!$E:$E,$B39,'1. Costs linked to activities'!$D:$D,G$15)+SUMIFS('2. Communication Costs'!$K:$K,'2. Communication Costs'!$E:$E,'Breakdown & Project Funding'!$B39,'2. Communication Costs'!$D:$D,'Breakdown & Project Funding'!G$15)+SUMIFS('3. Travel & Subsistence costs'!$R:$R,'3. Travel & Subsistence costs'!$E:$E,'Breakdown & Project Funding'!$B39,'3. Travel & Subsistence costs'!$D:$D,'Breakdown & Project Funding'!G$15)+SUMIFS('4. Personnel  costs'!$W:$W,'4. Personnel  costs'!$E:$E,'Breakdown & Project Funding'!$B39,'4. Personnel  costs'!$D:$D,'Breakdown & Project Funding'!G$15)+SUMIFS('5. Indirect Costs'!$J:$J,'5. Indirect Costs'!$E:$E,'Breakdown & Project Funding'!$B39,'5. Indirect Costs'!$D:$D,'Breakdown & Project Funding'!G$15)","v":0},0]
[null,"P25",{"$f":"SUMIFS('1. Costs linked to activities'!$K:$K,'1. Costs linked to activities'!$E:$E,$B40,'1. Costs linked to activities'!$D:$D,C$15)+SUMIFS('2. Communication Costs'!$K:$K,'2. Communication Costs'!$E:$E,'Breakdown & Project Funding'!$B40,'2. Communication Costs'!$D:$D,'Breakdown & Project Funding'!C$15)+SUMIFS('3. Travel & Subsistence costs'!$R:$R,'3. Travel & Subsistence costs'!$E:$E,'Breakdown & Project Funding'!$B40,'3. Travel & Subsistence costs'!$D:$D,'Breakdown & Project Funding'!C$15)+SUMIFS('4. Personnel  costs'!$W:$W,'4. Personnel  costs'!$E:$E,'Breakdown & Project Funding'!$B40,'4. Personnel  costs'!$D:$D,'Breakdown & Project Funding'!C$15)+SUMIFS('5. Indirect Costs'!$J:$J,'5. Indirect Costs'!$E:$E,'Breakdown & Project Funding'!$B40,'5. Indirect Costs'!$D:$D,'Breakdown & Project Funding'!C$15)","v":0},{"$f":"SUMIFS('1. Costs linked to activities'!$K:$K,'1. Costs linked to activities'!$E:$E,$B40,'1. Costs linked to activities'!$D:$D,D$15)+SUMIFS('2. Communication Costs'!$K:$K,'2. Communication Costs'!$E:$E,'Breakdown & Project Funding'!$B40,'2. Communication Costs'!$D:$D,'Breakdown & Project Funding'!D$15)+SUMIFS('3. Travel & Subsistence costs'!$R:$R,'3. Travel & Subsistence costs'!$E:$E,'Breakdown & Project Funding'!$B40,'3. Travel & Subsistence costs'!$D:$D,'Breakdown & Project Funding'!D$15)+SUMIFS('4. Personnel  costs'!$W:$W,'4. Personnel  costs'!$E:$E,'Breakdown & Project Funding'!$B40,'4. Personnel  costs'!$D:$D,'Breakdown & Project Funding'!D$15)+SUMIFS('5. Indirect Costs'!$J:$J,'5. Indirect Costs'!$E:$E,'Breakdown & Project Funding'!$B40,'5. Indirect Costs'!$D:$D,'Breakdown & Project Funding'!D$15)","v":0},{"$f":"SUMIFS('1. Costs linked to activities'!$K:$K,'1. Costs linked to activities'!$E:$E,$B40,'1. Costs linked to activities'!$D:$D,E$15)+SUMIFS('2. Communication Costs'!$K:$K,'2. Communication Costs'!$E:$E,'Breakdown & Project Funding'!$B40,'2. Communication Costs'!$D:$D,'Breakdown & Project Funding'!E$15)+SUMIFS('3. Travel & Subsistence costs'!$R:$R,'3. Travel & Subsistence costs'!$E:$E,'Breakdown & Project Funding'!$B40,'3. Travel & Subsistence costs'!$D:$D,'Breakdown & Project Funding'!E$15)+SUMIFS('4. Personnel  costs'!$W:$W,'4. Personnel  costs'!$E:$E,'Breakdown & Project Funding'!$B40,'4. Personnel  costs'!$D:$D,'Breakdown & Project Funding'!E$15)+SUMIFS('5. Indirect Costs'!$J:$J,'5. Indirect Costs'!$E:$E,'Breakdown & Project Funding'!$B40,'5. Indirect Costs'!$D:$D,'Breakdown & Project Funding'!E$15)","v":0},{"$f":"SUMIFS('1. Costs linked to activities'!$K:$K,'1. Costs linked to activities'!$E:$E,$B40,'1. Costs linked to activities'!$D:$D,F$15)+SUMIFS('2. Communication Costs'!$K:$K,'2. Communication Costs'!$E:$E,'Breakdown & Project Funding'!$B40,'2. Communication Costs'!$D:$D,'Breakdown & Project Funding'!F$15)+SUMIFS('3. Travel & Subsistence costs'!$R:$R,'3. Travel & Subsistence costs'!$E:$E,'Breakdown & Project Funding'!$B40,'3. Travel & Subsistence costs'!$D:$D,'Breakdown & Project Funding'!F$15)+SUMIFS('4. Personnel  costs'!$W:$W,'4. Personnel  costs'!$E:$E,'Breakdown & Project Funding'!$B40,'4. Personnel  costs'!$D:$D,'Breakdown & Project Funding'!F$15)+SUMIFS('5. Indirect Costs'!$J:$J,'5. Indirect Costs'!$E:$E,'Breakdown & Project Funding'!$B40,'5. Indirect Costs'!$D:$D,'Breakdown & Project Funding'!F$15)","v":0},{"$f":"SUMIFS('1. Costs linked to activities'!$K:$K,'1. Costs linked to activities'!$E:$E,$B40,'1. Costs linked to activities'!$D:$D,G$15)+SUMIFS('2. Communication Costs'!$K:$K,'2. Communication Costs'!$E:$E,'Breakdown & Project Funding'!$B40,'2. Communication Costs'!$D:$D,'Breakdown & Project Funding'!G$15)+SUMIFS('3. Travel & Subsistence costs'!$R:$R,'3. Travel & Subsistence costs'!$E:$E,'Breakdown & Project Funding'!$B40,'3. Travel & Subsistence costs'!$D:$D,'Breakdown & Project Funding'!G$15)+SUMIFS('4. Personnel  costs'!$W:$W,'4. Personnel  costs'!$E:$E,'Breakdown & Project Funding'!$B40,'4. Personnel  costs'!$D:$D,'Breakdown & Project Funding'!G$15)+SUMIFS('5. Indirect Costs'!$J:$J,'5. Indirect Costs'!$E:$E,'Breakdown & Project Funding'!$B40,'5. Indirect Costs'!$D:$D,'Breakdown & Project Funding'!G$15)","v":0},0]
[null,"P26",{"$f":"SUMIFS('1. Costs linked to activities'!$K:$K,'1. Costs linked to activities'!$E:$E,$B41,'1. Costs linked to activities'!$D:$D,C$15)+SUMIFS('2. Communication Costs'!$K:$K,'2. Communication Costs'!$E:$E,'Breakdown & Project Funding'!$B41,'2. Communication Costs'!$D:$D,'Breakdown & Project Funding'!C$15)+SUMIFS('3. Travel & Subsistence costs'!$R:$R,'3. Travel & Subsistence costs'!$E:$E,'Breakdown & Project Funding'!$B41,'3. Travel & Subsistence costs'!$D:$D,'Breakdown & Project Funding'!C$15)+SUMIFS('4. Personnel  costs'!$W:$W,'4. Personnel  costs'!$E:$E,'Breakdown & Project Funding'!$B41,'4. Personnel  costs'!$D:$D,'Breakdown & Project Funding'!C$15)+SUMIFS('5. Indirect Costs'!$J:$J,'5. Indirect Costs'!$E:$E,'Breakdown & Project Funding'!$B41,'5. Indirect Costs'!$D:$D,'Breakdown & Project Funding'!C$15)","v":0},{"$f":"SUMIFS('1. Costs linked to activities'!$K:$K,'1. Costs linked to activities'!$E:$E,$B41,'1. Costs linked to activities'!$D:$D,D$15)+SUMIFS('2. Communication Costs'!$K:$K,'2. Communication Costs'!$E:$E,'Breakdown & Project Funding'!$B41,'2. Communication Costs'!$D:$D,'Breakdown & Project Funding'!D$15)+SUMIFS('3. Travel & Subsistence costs'!$R:$R,'3. Travel & Subsistence costs'!$E:$E,'Breakdown & Project Funding'!$B41,'3. Travel & Subsistence costs'!$D:$D,'Breakdown & Project Funding'!D$15)+SUMIFS('4. Personnel  costs'!$W:$W,'4. Personnel  costs'!$E:$E,'Breakdown & Project Funding'!$B41,'4. Personnel  costs'!$D:$D,'Breakdown & Project Funding'!D$15)+SUMIFS('5. Indirect Costs'!$J:$J,'5. Indirect Costs'!$E:$E,'Breakdown & Project Funding'!$B41,'5. Indirect Costs'!$D:$D,'Breakdown & Project Funding'!D$15)","v":0},{"$f":"SUMIFS('1. Costs linked to activities'!$K:$K,'1. Costs linked to activities'!$E:$E,$B41,'1. Costs linked to activities'!$D:$D,E$15)+SUMIFS('2. Communication Costs'!$K:$K,'2. Communication Costs'!$E:$E,'Breakdown & Project Funding'!$B41,'2. Communication Costs'!$D:$D,'Breakdown & Project Funding'!E$15)+SUMIFS('3. Travel & Subsistence costs'!$R:$R,'3. Travel & Subsistence costs'!$E:$E,'Breakdown & Project Funding'!$B41,'3. Travel & Subsistence costs'!$D:$D,'Breakdown & Project Funding'!E$15)+SUMIFS('4. Personnel  costs'!$W:$W,'4. Personnel  costs'!$E:$E,'Breakdown & Project Funding'!$B41,'4. Personnel  costs'!$D:$D,'Breakdown & Project Funding'!E$15)+SUMIFS('5. Indirect Costs'!$J:$J,'5. Indirect Costs'!$E:$E,'Breakdown & Project Funding'!$B41,'5. Indirect Costs'!$D:$D,'Breakdown & Project Funding'!E$15)","v":0},{"$f":"SUMIFS('1. Costs linked to activities'!$K:$K,'1. Costs linked to activities'!$E:$E,$B41,'1. Costs linked to activities'!$D:$D,F$15)+SUMIFS('2. Communication Costs'!$K:$K,'2. Communication Costs'!$E:$E,'Breakdown & Project Funding'!$B41,'2. Communication Costs'!$D:$D,'Breakdown & Project Funding'!F$15)+SUMIFS('3. Travel & Subsistence costs'!$R:$R,'3. Travel & Subsistence costs'!$E:$E,'Breakdown & Project Funding'!$B41,'3. Travel & Subsistence costs'!$D:$D,'Breakdown & Project Funding'!F$15)+SUMIFS('4. Personnel  costs'!$W:$W,'4. Personnel  costs'!$E:$E,'Breakdown & Project Funding'!$B41,'4. Personnel  costs'!$D:$D,'Breakdown & Project Funding'!F$15)+SUMIFS('5. Indirect Costs'!$J:$J,'5. Indirect Costs'!$E:$E,'Breakdown & Project Funding'!$B41,'5. Indirect Costs'!$D:$D,'Breakdown & Project Funding'!F$15)","v":0},{"$f":"SUMIFS('1. Costs linked to activities'!$K:$K,'1. Costs linked to activities'!$E:$E,$B41,'1. Costs linked to activities'!$D:$D,G$15)+SUMIFS('2. Communication Costs'!$K:$K,'2. Communication Costs'!$E:$E,'Breakdown & Project Funding'!$B41,'2. Communication Costs'!$D:$D,'Breakdown & Project Funding'!G$15)+SUMIFS('3. Travel & Subsistence costs'!$R:$R,'3. Travel & Subsistence costs'!$E:$E,'Breakdown & Project Funding'!$B41,'3. Travel & Subsistence costs'!$D:$D,'Breakdown & Project Funding'!G$15)+SUMIFS('4. Personnel  costs'!$W:$W,'4. Personnel  costs'!$E:$E,'Breakdown & Project Funding'!$B41,'4. Personnel  costs'!$D:$D,'Breakdown & Project Funding'!G$15)+SUMIFS('5. Indirect Costs'!$J:$J,'5. Indirect Costs'!$E:$E,'Breakdown & Project Funding'!$B41,'5. Indirect Costs'!$D:$D,'Breakdown & Project Funding'!G$15)","v":0},0]
[null,"P27",{"$f":"SUMIFS('1. Costs linked to activities'!$K:$K,'1. Costs linked to activities'!$E:$E,$B42,'1. Costs linked to activities'!$D:$D,C$15)+SUMIFS('2. Communication Costs'!$K:$K,'2. Communication Costs'!$E:$E,'Breakdown & Project Funding'!$B42,'2. Communication Costs'!$D:$D,'Breakdown & Project Funding'!C$15)+SUMIFS('3. Travel & Subsistence costs'!$R:$R,'3. Travel & Subsistence costs'!$E:$E,'Breakdown & Project Funding'!$B42,'3. Travel & Subsistence costs'!$D:$D,'Breakdown & Project Funding'!C$15)+SUMIFS('4. Personnel  costs'!$W:$W,'4. Personnel  costs'!$E:$E,'Breakdown & Project Funding'!$B42,'4. Personnel  costs'!$D:$D,'Breakdown & Project Funding'!C$15)+SUMIFS('5. Indirect Costs'!$J:$J,'5. Indirect Costs'!$E:$E,'Breakdown & Project Funding'!$B42,'5. Indirect Costs'!$D:$D,'Breakdown & Project Funding'!C$15)","v":0},{"$f":"SUMIFS('1. Costs linked to activities'!$K:$K,'1. Costs linked to activities'!$E:$E,$B42,'1. Costs linked to activities'!$D:$D,D$15)+SUMIFS('2. Communication Costs'!$K:$K,'2. Communication Costs'!$E:$E,'Breakdown & Project Funding'!$B42,'2. Communication Costs'!$D:$D,'Breakdown & Project Funding'!D$15)+SUMIFS('3. Travel & Subsistence costs'!$R:$R,'3. Travel & Subsistence costs'!$E:$E,'Breakdown & Project Funding'!$B42,'3. Travel & Subsistence costs'!$D:$D,'Breakdown & Project Funding'!D$15)+SUMIFS('4. Personnel  costs'!$W:$W,'4. Personnel  costs'!$E:$E,'Breakdown & Project Funding'!$B42,'4. Personnel  costs'!$D:$D,'Breakdown & Project Funding'!D$15)+SUMIFS('5. Indirect Costs'!$J:$J,'5. Indirect Costs'!$E:$E,'Breakdown & Project Funding'!$B42,'5. Indirect Costs'!$D:$D,'Breakdown & Project Funding'!D$15)","v":0},{"$f":"SUMIFS('1. Costs linked to activities'!$K:$K,'1. Costs linked to activities'!$E:$E,$B42,'1. Costs linked to activities'!$D:$D,E$15)+SUMIFS('2. Communication Costs'!$K:$K,'2. Communication Costs'!$E:$E,'Breakdown & Project Funding'!$B42,'2. Communication Costs'!$D:$D,'Breakdown & Project Funding'!E$15)+SUMIFS('3. Travel & Subsistence costs'!$R:$R,'3. Travel & Subsistence costs'!$E:$E,'Breakdown & Project Funding'!$B42,'3. Travel & Subsistence costs'!$D:$D,'Breakdown & Project Funding'!E$15)+SUMIFS('4. Personnel  costs'!$W:$W,'4. Personnel  costs'!$E:$E,'Breakdown & Project Funding'!$B42,'4. Personnel  costs'!$D:$D,'Breakdown & Project Funding'!E$15)+SUMIFS('5. Indirect Costs'!$J:$J,'5. Indirect Costs'!$E:$E,'Breakdown & Project Funding'!$B42,'5. Indirect Costs'!$D:$D,'Breakdown & Project Funding'!E$15)","v":0},{"$f":"SUMIFS('1. Costs linked to activities'!$K:$K,'1. Costs linked to activities'!$E:$E,$B42,'1. Costs linked to activities'!$D:$D,F$15)+SUMIFS('2. Communication Costs'!$K:$K,'2. Communication Costs'!$E:$E,'Breakdown & Project Funding'!$B42,'2. Communication Costs'!$D:$D,'Breakdown & Project Funding'!F$15)+SUMIFS('3. Travel & Subsistence costs'!$R:$R,'3. Travel & Subsistence costs'!$E:$E,'Breakdown & Project Funding'!$B42,'3. Travel & Subsistence costs'!$D:$D,'Breakdown & Project Funding'!F$15)+SUMIFS('4. Personnel  costs'!$W:$W,'4. Personnel  costs'!$E:$E,'Breakdown & Project Funding'!$B42,'4. Personnel  costs'!$D:$D,'Breakdown & Project Funding'!F$15)+SUMIFS('5. Indirect Costs'!$J:$J,'5. Indirect Costs'!$E:$E,'Breakdown & Project Funding'!$B42,'5. Indirect Costs'!$D:$D,'Breakdown & Project Funding'!F$15)","v":0},{"$f":"SUMIFS('1. Costs linked to activities'!$K:$K,'1. Costs linked to activities'!$E:$E,$B42,'1. Costs linked to activities'!$D:$D,G$15)+SUMIFS('2. Communication Costs'!$K:$K,'2. Communication Costs'!$E:$E,'Breakdown & Project Funding'!$B42,'2. Communication Costs'!$D:$D,'Breakdown & Project Funding'!G$15)+SUMIFS('3. Travel & Subsistence costs'!$R:$R,'3. Travel & Subsistence costs'!$E:$E,'Breakdown & Project Funding'!$B42,'3. Travel & Subsistence costs'!$D:$D,'Breakdown & Project Funding'!G$15)+SUMIFS('4. Personnel  costs'!$W:$W,'4. Personnel  costs'!$E:$E,'Breakdown & Project Funding'!$B42,'4. Personnel  costs'!$D:$D,'Breakdown & Project Funding'!G$15)+SUMIFS('5. Indirect Costs'!$J:$J,'5. Indirect Costs'!$E:$E,'Breakdown & Project Funding'!$B42,'5. Indirect Costs'!$D:$D,'Breakdown & Project Funding'!G$15)","v":0},0]
[null,"P28",{"$f":"SUMIFS('1. Costs linked to activities'!$K:$K,'1. Costs linked to activities'!$E:$E,$B43,'1. Costs linked to activities'!$D:$D,C$15)+SUMIFS('2. Communication Costs'!$K:$K,'2. Communication Costs'!$E:$E,'Breakdown & Project Funding'!$B43,'2. Communication Costs'!$D:$D,'Breakdown & Project Funding'!C$15)+SUMIFS('3. Travel & Subsistence costs'!$R:$R,'3. Travel & Subsistence costs'!$E:$E,'Breakdown & Project Funding'!$B43,'3. Travel & Subsistence costs'!$D:$D,'Breakdown & Project Funding'!C$15)+SUMIFS('4. Personnel  costs'!$W:$W,'4. Personnel  costs'!$E:$E,'Breakdown & Project Funding'!$B43,'4. Personnel  costs'!$D:$D,'Breakdown & Project Funding'!C$15)+SUMIFS('5. Indirect Costs'!$J:$J,'5. Indirect Costs'!$E:$E,'Breakdown & Project Funding'!$B43,'5. Indirect Costs'!$D:$D,'Breakdown & Project Funding'!C$15)","v":0},{"$f":"SUMIFS('1. Costs linked to activities'!$K:$K,'1. Costs linked to activities'!$E:$E,$B43,'1. Costs linked to activities'!$D:$D,D$15)+SUMIFS('2. Communication Costs'!$K:$K,'2. Communication Costs'!$E:$E,'Breakdown & Project Funding'!$B43,'2. Communication Costs'!$D:$D,'Breakdown & Project Funding'!D$15)+SUMIFS('3. Travel & Subsistence costs'!$R:$R,'3. Travel & Subsistence costs'!$E:$E,'Breakdown & Project Funding'!$B43,'3. Travel & Subsistence costs'!$D:$D,'Breakdown & Project Funding'!D$15)+SUMIFS('4. Personnel  costs'!$W:$W,'4. Personnel  costs'!$E:$E,'Breakdown & Project Funding'!$B43,'4. Personnel  costs'!$D:$D,'Breakdown & Project Funding'!D$15)+SUMIFS('5. Indirect Costs'!$J:$J,'5. Indirect Costs'!$E:$E,'Breakdown & Project Funding'!$B43,'5. Indirect Costs'!$D:$D,'Breakdown & Project Funding'!D$15)","v":0},{"$f":"SUMIFS('1. Costs linked to activities'!$K:$K,'1. Costs linked to activities'!$E:$E,$B43,'1. Costs linked to activities'!$D:$D,E$15)+SUMIFS('2. Communication Costs'!$K:$K,'2. Communication Costs'!$E:$E,'Breakdown & Project Funding'!$B43,'2. Communication Costs'!$D:$D,'Breakdown & Project Funding'!E$15)+SUMIFS('3. Travel & Subsistence costs'!$R:$R,'3. Travel & Subsistence costs'!$E:$E,'Breakdown & Project Funding'!$B43,'3. Travel & Subsistence costs'!$D:$D,'Breakdown & Project Funding'!E$15)+SUMIFS('4. Personnel  costs'!$W:$W,'4. Personnel  costs'!$E:$E,'Breakdown & Project Funding'!$B43,'4. Personnel  costs'!$D:$D,'Breakdown & Project Funding'!E$15)+SUMIFS('5. Indirect Costs'!$J:$J,'5. Indirect Costs'!$E:$E,'Breakdown & Project Funding'!$B43,'5. Indirect Costs'!$D:$D,'Breakdown & Project Funding'!E$15)","v":0},{"$f":"SUMIFS('1. Costs linked to activities'!$K:$K,'1. Costs linked to activities'!$E:$E,$B43,'1. Costs linked to activities'!$D:$D,F$15)+SUMIFS('2. Communication Costs'!$K:$K,'2. Communication Costs'!$E:$E,'Breakdown & Project Funding'!$B43,'2. Communication Costs'!$D:$D,'Breakdown & Project Funding'!F$15)+SUMIFS('3. Travel & Subsistence costs'!$R:$R,'3. Travel & Subsistence costs'!$E:$E,'Breakdown & Project Funding'!$B43,'3. Travel & Subsistence costs'!$D:$D,'Breakdown & Project Funding'!F$15)+SUMIFS('4. Personnel  costs'!$W:$W,'4. Personnel  costs'!$E:$E,'Breakdown & Project Funding'!$B43,'4. Personnel  costs'!$D:$D,'Breakdown & Project Funding'!F$15)+SUMIFS('5. Indirect Costs'!$J:$J,'5. Indirect Costs'!$E:$E,'Breakdown & Project Funding'!$B43,'5. Indirect Costs'!$D:$D,'Breakdown & Project Funding'!F$15)","v":0},{"$f":"SUMIFS('1. Costs linked to activities'!$K:$K,'1. Costs linked to activities'!$E:$E,$B43,'1. Costs linked to activities'!$D:$D,G$15)+SUMIFS('2. Communication Costs'!$K:$K,'2. Communication Costs'!$E:$E,'Breakdown & Project Funding'!$B43,'2. Communication Costs'!$D:$D,'Breakdown & Project Funding'!G$15)+SUMIFS('3. Travel & Subsistence costs'!$R:$R,'3. Travel & Subsistence costs'!$E:$E,'Breakdown & Project Funding'!$B43,'3. Travel & Subsistence costs'!$D:$D,'Breakdown & Project Funding'!G$15)+SUMIFS('4. Personnel  costs'!$W:$W,'4. Personnel  costs'!$E:$E,'Breakdown & Project Funding'!$B43,'4. Personnel  costs'!$D:$D,'Breakdown & Project Funding'!G$15)+SUMIFS('5. Indirect Costs'!$J:$J,'5. Indirect Costs'!$E:$E,'Breakdown & Project Funding'!$B43,'5. Indirect Costs'!$D:$D,'Breakdown & Project Funding'!G$15)","v":0},0]
[null,"P29",{"$f":"SUMIFS('1. Costs linked to activities'!$K:$K,'1. Costs linked to activities'!$E:$E,$B44,'1. Costs linked to activities'!$D:$D,C$15)+SUMIFS('2. Communication Costs'!$K:$K,'2. Communication Costs'!$E:$E,'Breakdown & Project Funding'!$B44,'2. Communication Costs'!$D:$D,'Breakdown & Project Funding'!C$15)+SUMIFS('3. Travel & Subsistence costs'!$R:$R,'3. Travel & Subsistence costs'!$E:$E,'Breakdown & Project Funding'!$B44,'3. Travel & Subsistence costs'!$D:$D,'Breakdown & Project Funding'!C$15)+SUMIFS('4. Personnel  costs'!$W:$W,'4. Personnel  costs'!$E:$E,'Breakdown & Project Funding'!$B44,'4. Personnel  costs'!$D:$D,'Breakdown & Project Funding'!C$15)+SUMIFS('5. Indirect Costs'!$J:$J,'5. Indirect Costs'!$E:$E,'Breakdown & Project Funding'!$B44,'5. Indirect Costs'!$D:$D,'Breakdown & Project Funding'!C$15)","v":0},{"$f":"SUMIFS('1. Costs linked to activities'!$K:$K,'1. Costs linked to activities'!$E:$E,$B44,'1. Costs linked to activities'!$D:$D,D$15)+SUMIFS('2. Communication Costs'!$K:$K,'2. Communication Costs'!$E:$E,'Breakdown & Project Funding'!$B44,'2. Communication Costs'!$D:$D,'Breakdown & Project Funding'!D$15)+SUMIFS('3. Travel & Subsistence costs'!$R:$R,'3. Travel & Subsistence costs'!$E:$E,'Breakdown & Project Funding'!$B44,'3. Travel & Subsistence costs'!$D:$D,'Breakdown & Project Funding'!D$15)+SUMIFS('4. Personnel  costs'!$W:$W,'4. Personnel  costs'!$E:$E,'Breakdown & Project Funding'!$B44,'4. Personnel  costs'!$D:$D,'Breakdown & Project Funding'!D$15)+SUMIFS('5. Indirect Costs'!$J:$J,'5. Indirect Costs'!$E:$E,'Breakdown & Project Funding'!$B44,'5. Indirect Costs'!$D:$D,'Breakdown & Project Funding'!D$15)","v":0},{"$f":"SUMIFS('1. Costs linked to activities'!$K:$K,'1. Costs linked to activities'!$E:$E,$B44,'1. Costs linked to activities'!$D:$D,E$15)+SUMIFS('2. Communication Costs'!$K:$K,'2. Communication Costs'!$E:$E,'Breakdown & Project Funding'!$B44,'2. Communication Costs'!$D:$D,'Breakdown & Project Funding'!E$15)+SUMIFS('3. Travel & Subsistence costs'!$R:$R,'3. Travel & Subsistence costs'!$E:$E,'Breakdown & Project Funding'!$B44,'3. Travel & Subsistence costs'!$D:$D,'Breakdown & Project Funding'!E$15)+SUMIFS('4. Personnel  costs'!$W:$W,'4. Personnel  costs'!$E:$E,'Breakdown & Project Funding'!$B44,'4. Personnel  costs'!$D:$D,'Breakdown & Project Funding'!E$15)+SUMIFS('5. Indirect Costs'!$J:$J,'5. Indirect Costs'!$E:$E,'Breakdown & Project Funding'!$B44,'5. Indirect Costs'!$D:$D,'Breakdown & Project Funding'!E$15)","v":0},{"$f":"SUMIFS('1. Costs linked to activities'!$K:$K,'1. Costs linked to activities'!$E:$E,$B44,'1. Costs linked to activities'!$D:$D,F$15)+SUMIFS('2. Communication Costs'!$K:$K,'2. Communication Costs'!$E:$E,'Breakdown & Project Funding'!$B44,'2. Communication Costs'!$D:$D,'Breakdown & Project Funding'!F$15)+SUMIFS('3. Travel & Subsistence costs'!$R:$R,'3. Travel & Subsistence costs'!$E:$E,'Breakdown & Project Funding'!$B44,'3. Travel & Subsistence costs'!$D:$D,'Breakdown & Project Funding'!F$15)+SUMIFS('4. Personnel  costs'!$W:$W,'4. Personnel  costs'!$E:$E,'Breakdown & Project Funding'!$B44,'4. Personnel  costs'!$D:$D,'Breakdown & Project Funding'!F$15)+SUMIFS('5. Indirect Costs'!$J:$J,'5. Indirect Costs'!$E:$E,'Breakdown & Project Funding'!$B44,'5. Indirect Costs'!$D:$D,'Breakdown & Project Funding'!F$15)","v":0},{"$f":"SUMIFS('1. Costs linked to activities'!$K:$K,'1. Costs linked to activities'!$E:$E,$B44,'1. Costs linked to activities'!$D:$D,G$15)+SUMIFS('2. Communication Costs'!$K:$K,'2. Communication Costs'!$E:$E,'Breakdown & Project Funding'!$B44,'2. Communication Costs'!$D:$D,'Breakdown & Project Funding'!G$15)+SUMIFS('3. Travel & Subsistence costs'!$R:$R,'3. Travel & Subsistence costs'!$E:$E,'Breakdown & Project Funding'!$B44,'3. Travel & Subsistence costs'!$D:$D,'Breakdown & Project Funding'!G$15)+SUMIFS('4. Personnel  costs'!$W:$W,'4. Personnel  costs'!$E:$E,'Breakdown & Project Funding'!$B44,'4. Personnel  costs'!$D:$D,'Breakdown & Project Funding'!G$15)+SUMIFS('5. Indirect Costs'!$J:$J,'5. Indirect Costs'!$E:$E,'Breakdown & Project Funding'!$B44,'5. Indirect Costs'!$D:$D,'Breakdown & Project Funding'!G$15)","v":0},0]
[null,"P30",{"$f":"SUMIFS('1. Costs linked to activities'!$K:$K,'1. Costs linked to activities'!$E:$E,$B45,'1. Costs linked to activities'!$D:$D,C$15)+SUMIFS('2. Communication Costs'!$K:$K,'2. Communication Costs'!$E:$E,'Breakdown & Project Funding'!$B45,'2. Communication Costs'!$D:$D,'Breakdown & Project Funding'!C$15)+SUMIFS('3. Travel & Subsistence costs'!$R:$R,'3. Travel & Subsistence costs'!$E:$E,'Breakdown & Project Funding'!$B45,'3. Travel & Subsistence costs'!$D:$D,'Breakdown & Project Funding'!C$15)+SUMIFS('4. Personnel  costs'!$W:$W,'4. Personnel  costs'!$E:$E,'Breakdown & Project Funding'!$B45,'4. Personnel  costs'!$D:$D,'Breakdown & Project Funding'!C$15)+SUMIFS('5. Indirect Costs'!$J:$J,'5. Indirect Costs'!$E:$E,'Breakdown & Project Funding'!$B45,'5. Indirect Costs'!$D:$D,'Breakdown & Project Funding'!C$15)","v":0},{"$f":"SUMIFS('1. Costs linked to activities'!$K:$K,'1. Costs linked to activities'!$E:$E,$B45,'1. Costs linked to activities'!$D:$D,D$15)+SUMIFS('2. Communication Costs'!$K:$K,'2. Communication Costs'!$E:$E,'Breakdown & Project Funding'!$B45,'2. Communication Costs'!$D:$D,'Breakdown & Project Funding'!D$15)+SUMIFS('3. Travel & Subsistence costs'!$R:$R,'3. Travel & Subsistence costs'!$E:$E,'Breakdown & Project Funding'!$B45,'3. Travel & Subsistence costs'!$D:$D,'Breakdown & Project Funding'!D$15)+SUMIFS('4. Personnel  costs'!$W:$W,'4. Personnel  costs'!$E:$E,'Breakdown & Project Funding'!$B45,'4. Personnel  costs'!$D:$D,'Breakdown & Project Funding'!D$15)+SUMIFS('5. Indirect Costs'!$J:$J,'5. Indirect Costs'!$E:$E,'Breakdown & Project Funding'!$B45,'5. Indirect Costs'!$D:$D,'Breakdown & Project Funding'!D$15)","v":0},{"$f":"SUMIFS('1. Costs linked to activities'!$K:$K,'1. Costs linked to activities'!$E:$E,$B45,'1. Costs linked to activities'!$D:$D,E$15)+SUMIFS('2. Communication Costs'!$K:$K,'2. Communication Costs'!$E:$E,'Breakdown & Project Funding'!$B45,'2. Communication Costs'!$D:$D,'Breakdown & Project Funding'!E$15)+SUMIFS('3. Travel & Subsistence costs'!$R:$R,'3. Travel & Subsistence costs'!$E:$E,'Breakdown & Project Funding'!$B45,'3. Travel & Subsistence costs'!$D:$D,'Breakdown & Project Funding'!E$15)+SUMIFS('4. Personnel  costs'!$W:$W,'4. Personnel  costs'!$E:$E,'Breakdown & Project Funding'!$B45,'4. Personnel  costs'!$D:$D,'Breakdown & Project Funding'!E$15)+SUMIFS('5. Indirect Costs'!$J:$J,'5. Indirect Costs'!$E:$E,'Breakdown & Project Funding'!$B45,'5. Indirect Costs'!$D:$D,'Breakdown & Project Funding'!E$15)","v":0},{"$f":"SUMIFS('1. Costs linked to activities'!$K:$K,'1. Costs linked to activities'!$E:$E,$B45,'1. Costs linked to activities'!$D:$D,F$15)+SUMIFS('2. Communication Costs'!$K:$K,'2. Communication Costs'!$E:$E,'Breakdown & Project Funding'!$B45,'2. Communication Costs'!$D:$D,'Breakdown & Project Funding'!F$15)+SUMIFS('3. Travel & Subsistence costs'!$R:$R,'3. Travel & Subsistence costs'!$E:$E,'Breakdown & Project Funding'!$B45,'3. Travel & Subsistence costs'!$D:$D,'Breakdown & Project Funding'!F$15)+SUMIFS('4. Personnel  costs'!$W:$W,'4. Personnel  costs'!$E:$E,'Breakdown & Project Funding'!$B45,'4. Personnel  costs'!$D:$D,'Breakdown & Project Funding'!F$15)+SUMIFS('5. Indirect Costs'!$J:$J,'5. Indirect Costs'!$E:$E,'Breakdown & Project Funding'!$B45,'5. Indirect Costs'!$D:$D,'Breakdown & Project Funding'!F$15)","v":0},{"$f":"SUMIFS('1. Costs linked to activities'!$K:$K,'1. Costs linked to activities'!$E:$E,$B45,'1. Costs linked to activities'!$D:$D,G$15)+SUMIFS('2. Communication Costs'!$K:$K,'2. Communication Costs'!$E:$E,'Breakdown & Project Funding'!$B45,'2. Communication Costs'!$D:$D,'Breakdown & Project Funding'!G$15)+SUMIFS('3. Travel & Subsistence costs'!$R:$R,'3. Travel & Subsistence costs'!$E:$E,'Breakdown & Project Funding'!$B45,'3. Travel & Subsistence costs'!$D:$D,'Breakdown & Project Funding'!G$15)+SUMIFS('4. Personnel  costs'!$W:$W,'4. Personnel  costs'!$E:$E,'Breakdown & Project Funding'!$B45,'4. Personnel  costs'!$D:$D,'Breakdown & Project Funding'!G$15)+SUMIFS('5. Indirect Costs'!$J:$J,'5. Indirect Costs'!$E:$E,'Breakdown & Project Funding'!$B45,'5. Indirect Costs'!$D:$D,'Breakdown & Project Funding'!G$15)","v":0},0]
[null,"P31",{"$f":"SUMIFS('1. Costs linked to activities'!$K:$K,'1. Costs linked to activities'!$E:$E,$B46,'1. Costs linked to activities'!$D:$D,C$15)+SUMIFS('2. Communication Costs'!$K:$K,'2. Communication Costs'!$E:$E,'Breakdown & Project Funding'!$B46,'2. Communication Costs'!$D:$D,'Breakdown & Project Funding'!C$15)+SUMIFS('3. Travel & Subsistence costs'!$R:$R,'3. Travel & Subsistence costs'!$E:$E,'Breakdown & Project Funding'!$B46,'3. Travel & Subsistence costs'!$D:$D,'Breakdown & Project Funding'!C$15)+SUMIFS('4. Personnel  costs'!$W:$W,'4. Personnel  costs'!$E:$E,'Breakdown & Project Funding'!$B46,'4. Personnel  costs'!$D:$D,'Breakdown & Project Funding'!C$15)+SUMIFS('5. Indirect Costs'!$J:$J,'5. Indirect Costs'!$E:$E,'Breakdown & Project Funding'!$B46,'5. Indirect Costs'!$D:$D,'Breakdown & Project Funding'!C$15)","v":0},{"$f":"SUMIFS('1. Costs linked to activities'!$K:$K,'1. Costs linked to activities'!$E:$E,$B46,'1. Costs linked to activities'!$D:$D,D$15)+SUMIFS('2. Communication Costs'!$K:$K,'2. Communication Costs'!$E:$E,'Breakdown & Project Funding'!$B46,'2. Communication Costs'!$D:$D,'Breakdown & Project Funding'!D$15)+SUMIFS('3. Travel & Subsistence costs'!$R:$R,'3. Travel & Subsistence costs'!$E:$E,'Breakdown & Project Funding'!$B46,'3. Travel & Subsistence costs'!$D:$D,'Breakdown & Project Funding'!D$15)+SUMIFS('4. Personnel  costs'!$W:$W,'4. Personnel  costs'!$E:$E,'Breakdown & Project Funding'!$B46,'4. Personnel  costs'!$D:$D,'Breakdown & Project Funding'!D$15)+SUMIFS('5. Indirect Costs'!$J:$J,'5. Indirect Costs'!$E:$E,'Breakdown & Project Funding'!$B46,'5. Indirect Costs'!$D:$D,'Breakdown & Project Funding'!D$15)","v":0},{"$f":"SUMIFS('1. Costs linked to activities'!$K:$K,'1. Costs linked to activities'!$E:$E,$B46,'1. Costs linked to activities'!$D:$D,E$15)+SUMIFS('2. Communication Costs'!$K:$K,'2. Communication Costs'!$E:$E,'Breakdown & Project Funding'!$B46,'2. Communication Costs'!$D:$D,'Breakdown & Project Funding'!E$15)+SUMIFS('3. Travel & Subsistence costs'!$R:$R,'3. Travel & Subsistence costs'!$E:$E,'Breakdown & Project Funding'!$B46,'3. Travel & Subsistence costs'!$D:$D,'Breakdown & Project Funding'!E$15)+SUMIFS('4. Personnel  costs'!$W:$W,'4. Personnel  costs'!$E:$E,'Breakdown & Project Funding'!$B46,'4. Personnel  costs'!$D:$D,'Breakdown & Project Funding'!E$15)+SUMIFS('5. Indirect Costs'!$J:$J,'5. Indirect Costs'!$E:$E,'Breakdown & Project Funding'!$B46,'5. Indirect Costs'!$D:$D,'Breakdown & Project Funding'!E$15)","v":0},{"$f":"SUMIFS('1. Costs linked to activities'!$K:$K,'1. Costs linked to activities'!$E:$E,$B46,'1. Costs linked to activities'!$D:$D,F$15)+SUMIFS('2. Communication Costs'!$K:$K,'2. Communication Costs'!$E:$E,'Breakdown & Project Funding'!$B46,'2. Communication Costs'!$D:$D,'Breakdown & Project Funding'!F$15)+SUMIFS('3. Travel & Subsistence costs'!$R:$R,'3. Travel & Subsistence costs'!$E:$E,'Breakdown & Project Funding'!$B46,'3. Travel & Subsistence costs'!$D:$D,'Breakdown & Project Funding'!F$15)+SUMIFS('4. Personnel  costs'!$W:$W,'4. Personnel  costs'!$E:$E,'Breakdown & Project Funding'!$B46,'4. Personnel  costs'!$D:$D,'Breakdown & Project Funding'!F$15)+SUMIFS('5. Indirect Costs'!$J:$J,'5. Indirect Costs'!$E:$E,'Breakdown & Project Funding'!$B46,'5. Indirect Costs'!$D:$D,'Breakdown & Project Funding'!F$15)","v":0},{"$f":"SUMIFS('1. Costs linked to activities'!$K:$K,'1. Costs linked to activities'!$E:$E,$B46,'1. Costs linked to activities'!$D:$D,G$15)+SUMIFS('2. Communication Costs'!$K:$K,'2. Communication Costs'!$E:$E,'Breakdown & Project Funding'!$B46,'2. Communication Costs'!$D:$D,'Breakdown & Project Funding'!G$15)+SUMIFS('3. Travel & Subsistence costs'!$R:$R,'3. Travel & Subsistence costs'!$E:$E,'Breakdown & Project Funding'!$B46,'3. Travel & Subsistence costs'!$D:$D,'Breakdown & Project Funding'!G$15)+SUMIFS('4. Personnel  costs'!$W:$W,'4. Personnel  costs'!$E:$E,'Breakdown & Project Funding'!$B46,'4. Personnel  costs'!$D:$D,'Breakdown & Project Funding'!G$15)+SUMIFS('5. Indirect Costs'!$J:$J,'5. Indirect Costs'!$E:$E,'Breakdown & Project Funding'!$B46,'5. Indirect Costs'!$D:$D,'Breakdown & Project Funding'!G$15)","v":0},0]
[null,"P32",{"$f":"SUMIFS('1. Costs linked to activities'!$K:$K,'1. Costs linked to activities'!$E:$E,$B47,'1. Costs linked to activities'!$D:$D,C$15)+SUMIFS('2. Communication Costs'!$K:$K,'2. Communication Costs'!$E:$E,'Breakdown & Project Funding'!$B47,'2. Communication Costs'!$D:$D,'Breakdown & Project Funding'!C$15)+SUMIFS('3. Travel & Subsistence costs'!$R:$R,'3. Travel & Subsistence costs'!$E:$E,'Breakdown & Project Funding'!$B47,'3. Travel & Subsistence costs'!$D:$D,'Breakdown & Project Funding'!C$15)+SUMIFS('4. Personnel  costs'!$W:$W,'4. Personnel  costs'!$E:$E,'Breakdown & Project Funding'!$B47,'4. Personnel  costs'!$D:$D,'Breakdown & Project Funding'!C$15)+SUMIFS('5. Indirect Costs'!$J:$J,'5. Indirect Costs'!$E:$E,'Breakdown & Project Funding'!$B47,'5. Indirect Costs'!$D:$D,'Breakdown & Project Funding'!C$15)","v":0},{"$f":"SUMIFS('1. Costs linked to activities'!$K:$K,'1. Costs linked to activities'!$E:$E,$B47,'1. Costs linked to activities'!$D:$D,D$15)+SUMIFS('2. Communication Costs'!$K:$K,'2. Communication Costs'!$E:$E,'Breakdown & Project Funding'!$B47,'2. Communication Costs'!$D:$D,'Breakdown & Project Funding'!D$15)+SUMIFS('3. Travel & Subsistence costs'!$R:$R,'3. Travel & Subsistence costs'!$E:$E,'Breakdown & Project Funding'!$B47,'3. Travel & Subsistence costs'!$D:$D,'Breakdown & Project Funding'!D$15)+SUMIFS('4. Personnel  costs'!$W:$W,'4. Personnel  costs'!$E:$E,'Breakdown & Project Funding'!$B47,'4. Personnel  costs'!$D:$D,'Breakdown & Project Funding'!D$15)+SUMIFS('5. Indirect Costs'!$J:$J,'5. Indirect Costs'!$E:$E,'Breakdown & Project Funding'!$B47,'5. Indirect Costs'!$D:$D,'Breakdown & Project Funding'!D$15)","v":0},{"$f":"SUMIFS('1. Costs linked to activities'!$K:$K,'1. Costs linked to activities'!$E:$E,$B47,'1. Costs linked to activities'!$D:$D,E$15)+SUMIFS('2. Communication Costs'!$K:$K,'2. Communication Costs'!$E:$E,'Breakdown & Project Funding'!$B47,'2. Communication Costs'!$D:$D,'Breakdown & Project Funding'!E$15)+SUMIFS('3. Travel & Subsistence costs'!$R:$R,'3. Travel & Subsistence costs'!$E:$E,'Breakdown & Project Funding'!$B47,'3. Travel & Subsistence costs'!$D:$D,'Breakdown & Project Funding'!E$15)+SUMIFS('4. Personnel  costs'!$W:$W,'4. Personnel  costs'!$E:$E,'Breakdown & Project Funding'!$B47,'4. Personnel  costs'!$D:$D,'Breakdown & Project Funding'!E$15)+SUMIFS('5. Indirect Costs'!$J:$J,'5. Indirect Costs'!$E:$E,'Breakdown & Project Funding'!$B47,'5. Indirect Costs'!$D:$D,'Breakdown & Project Funding'!E$15)","v":0},{"$f":"SUMIFS('1. Costs linked to activities'!$K:$K,'1. Costs linked to activities'!$E:$E,$B47,'1. Costs linked to activities'!$D:$D,F$15)+SUMIFS('2. Communication Costs'!$K:$K,'2. Communication Costs'!$E:$E,'Breakdown & Project Funding'!$B47,'2. Communication Costs'!$D:$D,'Breakdown & Project Funding'!F$15)+SUMIFS('3. Travel & Subsistence costs'!$R:$R,'3. Travel & Subsistence costs'!$E:$E,'Breakdown & Project Funding'!$B47,'3. Travel & Subsistence costs'!$D:$D,'Breakdown & Project Funding'!F$15)+SUMIFS('4. Personnel  costs'!$W:$W,'4. Personnel  costs'!$E:$E,'Breakdown & Project Funding'!$B47,'4. Personnel  costs'!$D:$D,'Breakdown & Project Funding'!F$15)+SUMIFS('5. Indirect Costs'!$J:$J,'5. Indirect Costs'!$E:$E,'Breakdown & Project Funding'!$B47,'5. Indirect Costs'!$D:$D,'Breakdown & Project Funding'!F$15)","v":0},{"$f":"SUMIFS('1. Costs linked to activities'!$K:$K,'1. Costs linked to activities'!$E:$E,$B47,'1. Costs linked to activities'!$D:$D,G$15)+SUMIFS('2. Communication Costs'!$K:$K,'2. Communication Costs'!$E:$E,'Breakdown & Project Funding'!$B47,'2. Communication Costs'!$D:$D,'Breakdown & Project Funding'!G$15)+SUMIFS('3. Travel & Subsistence costs'!$R:$R,'3. Travel & Subsistence costs'!$E:$E,'Breakdown & Project Funding'!$B47,'3. Travel & Subsistence costs'!$D:$D,'Breakdown & Project Funding'!G$15)+SUMIFS('4. Personnel  costs'!$W:$W,'4. Personnel  costs'!$E:$E,'Breakdown & Project Funding'!$B47,'4. Personnel  costs'!$D:$D,'Breakdown & Project Funding'!G$15)+SUMIFS('5. Indirect Costs'!$J:$J,'5. Indirect Costs'!$E:$E,'Breakdown & Project Funding'!$B47,'5. Indirect Costs'!$D:$D,'Breakdown & Project Funding'!G$15)","v":0},0]
[null,"P33",{"$f":"SUMIFS('1. Costs linked to activities'!$K:$K,'1. Costs linked to activities'!$E:$E,$B48,'1. Costs linked to activities'!$D:$D,C$15)+SUMIFS('2. Communication Costs'!$K:$K,'2. Communication Costs'!$E:$E,'Breakdown & Project Funding'!$B48,'2. Communication Costs'!$D:$D,'Breakdown & Project Funding'!C$15)+SUMIFS('3. Travel & Subsistence costs'!$R:$R,'3. Travel & Subsistence costs'!$E:$E,'Breakdown & Project Funding'!$B48,'3. Travel & Subsistence costs'!$D:$D,'Breakdown & Project Funding'!C$15)+SUMIFS('4. Personnel  costs'!$W:$W,'4. Personnel  costs'!$E:$E,'Breakdown & Project Funding'!$B48,'4. Personnel  costs'!$D:$D,'Breakdown & Project Funding'!C$15)+SUMIFS('5. Indirect Costs'!$J:$J,'5. Indirect Costs'!$E:$E,'Breakdown & Project Funding'!$B48,'5. Indirect Costs'!$D:$D,'Breakdown & Project Funding'!C$15)","v":0},{"$f":"SUMIFS('1. Costs linked to activities'!$K:$K,'1. Costs linked to activities'!$E:$E,$B48,'1. Costs linked to activities'!$D:$D,D$15)+SUMIFS('2. Communication Costs'!$K:$K,'2. Communication Costs'!$E:$E,'Breakdown & Project Funding'!$B48,'2. Communication Costs'!$D:$D,'Breakdown & Project Funding'!D$15)+SUMIFS('3. Travel & Subsistence costs'!$R:$R,'3. Travel & Subsistence costs'!$E:$E,'Breakdown & Project Funding'!$B48,'3. Travel & Subsistence costs'!$D:$D,'Breakdown & Project Funding'!D$15)+SUMIFS('4. Personnel  costs'!$W:$W,'4. Personnel  costs'!$E:$E,'Breakdown & Project Funding'!$B48,'4. Personnel  costs'!$D:$D,'Breakdown & Project Funding'!D$15)+SUMIFS('5. Indirect Costs'!$J:$J,'5. Indirect Costs'!$E:$E,'Breakdown & Project Funding'!$B48,'5. Indirect Costs'!$D:$D,'Breakdown & Project Funding'!D$15)","v":0},{"$f":"SUMIFS('1. Costs linked to activities'!$K:$K,'1. Costs linked to activities'!$E:$E,$B48,'1. Costs linked to activities'!$D:$D,E$15)+SUMIFS('2. Communication Costs'!$K:$K,'2. Communication Costs'!$E:$E,'Breakdown & Project Funding'!$B48,'2. Communication Costs'!$D:$D,'Breakdown & Project Funding'!E$15)+SUMIFS('3. Travel & Subsistence costs'!$R:$R,'3. Travel & Subsistence costs'!$E:$E,'Breakdown & Project Funding'!$B48,'3. Travel & Subsistence costs'!$D:$D,'Breakdown & Project Funding'!E$15)+SUMIFS('4. Personnel  costs'!$W:$W,'4. Personnel  costs'!$E:$E,'Breakdown & Project Funding'!$B48,'4. Personnel  costs'!$D:$D,'Breakdown & Project Funding'!E$15)+SUMIFS('5. Indirect Costs'!$J:$J,'5. Indirect Costs'!$E:$E,'Breakdown & Project Funding'!$B48,'5. Indirect Costs'!$D:$D,'Breakdown & Project Funding'!E$15)","v":0},{"$f":"SUMIFS('1. Costs linked to activities'!$K:$K,'1. Costs linked to activities'!$E:$E,$B48,'1. Costs linked to activities'!$D:$D,F$15)+SUMIFS('2. Communication Costs'!$K:$K,'2. Communication Costs'!$E:$E,'Breakdown & Project Funding'!$B48,'2. Communication Costs'!$D:$D,'Breakdown & Project Funding'!F$15)+SUMIFS('3. Travel & Subsistence costs'!$R:$R,'3. Travel & Subsistence costs'!$E:$E,'Breakdown & Project Funding'!$B48,'3. Travel & Subsistence costs'!$D:$D,'Breakdown & Project Funding'!F$15)+SUMIFS('4. Personnel  costs'!$W:$W,'4. Personnel  costs'!$E:$E,'Breakdown & Project Funding'!$B48,'4. Personnel  costs'!$D:$D,'Breakdown & Project Funding'!F$15)+SUMIFS('5. Indirect Costs'!$J:$J,'5. Indirect Costs'!$E:$E,'Breakdown & Project Funding'!$B48,'5. Indirect Costs'!$D:$D,'Breakdown & Project Funding'!F$15)","v":0},{"$f":"SUMIFS('1. Costs linked to activities'!$K:$K,'1. Costs linked to activities'!$E:$E,$B48,'1. Costs linked to activities'!$D:$D,G$15)+SUMIFS('2. Communication Costs'!$K:$K,'2. Communication Costs'!$E:$E,'Breakdown & Project Funding'!$B48,'2. Communication Costs'!$D:$D,'Breakdown & Project Funding'!G$15)+SUMIFS('3. Travel & Subsistence costs'!$R:$R,'3. Travel & Subsistence costs'!$E:$E,'Breakdown & Project Funding'!$B48,'3. Travel & Subsistence costs'!$D:$D,'Breakdown & Project Funding'!G$15)+SUMIFS('4. Personnel  costs'!$W:$W,'4. Personnel  costs'!$E:$E,'Breakdown & Project Funding'!$B48,'4. Personnel  costs'!$D:$D,'Breakdown & Project Funding'!G$15)+SUMIFS('5. Indirect Costs'!$J:$J,'5. Indirect Costs'!$E:$E,'Breakdown & Project Funding'!$B48,'5. Indirect Costs'!$D:$D,'Breakdown & Project Funding'!G$15)","v":0},{"$f":"SUM(C48:G48)","v":0}]
[null,"P34",{"$f":"SUMIFS('1. Costs linked to activities'!$K:$K,'1. Costs linked to activities'!$E:$E,$B49,'1. Costs linked to activities'!$D:$D,C$15)+SUMIFS('2. Communication Costs'!$K:$K,'2. Communication Costs'!$E:$E,'Breakdown & Project Funding'!$B49,'2. Communication Costs'!$D:$D,'Breakdown & Project Funding'!C$15)+SUMIFS('3. Travel & Subsistence costs'!$R:$R,'3. Travel & Subsistence costs'!$E:$E,'Breakdown & Project Funding'!$B49,'3. Travel & Subsistence costs'!$D:$D,'Breakdown & Project Funding'!C$15)+SUMIFS('4. Personnel  costs'!$W:$W,'4. Personnel  costs'!$E:$E,'Breakdown & Project Funding'!$B49,'4. Personnel  costs'!$D:$D,'Breakdown & Project Funding'!C$15)+SUMIFS('5. Indirect Costs'!$J:$J,'5. Indirect Costs'!$E:$E,'Breakdown & Project Funding'!$B49,'5. Indirect Costs'!$D:$D,'Breakdown & Project Funding'!C$15)","v":0},{"$f":"SUMIFS('1. Costs linked to activities'!$K:$K,'1. Costs linked to activities'!$E:$E,$B49,'1. Costs linked to activities'!$D:$D,D$15)+SUMIFS('2. Communication Costs'!$K:$K,'2. Communication Costs'!$E:$E,'Breakdown & Project Funding'!$B49,'2. Communication Costs'!$D:$D,'Breakdown & Project Funding'!D$15)+SUMIFS('3. Travel & Subsistence costs'!$R:$R,'3. Travel & Subsistence costs'!$E:$E,'Breakdown & Project Funding'!$B49,'3. Travel & Subsistence costs'!$D:$D,'Breakdown & Project Funding'!D$15)+SUMIFS('4. Personnel  costs'!$W:$W,'4. Personnel  costs'!$E:$E,'Breakdown & Project Funding'!$B49,'4. Personnel  costs'!$D:$D,'Breakdown & Project Funding'!D$15)+SUMIFS('5. Indirect Costs'!$J:$J,'5. Indirect Costs'!$E:$E,'Breakdown & Project Funding'!$B49,'5. Indirect Costs'!$D:$D,'Breakdown & Project Funding'!D$15)","v":0},{"$f":"SUMIFS('1. Costs linked to activities'!$K:$K,'1. Costs linked to activities'!$E:$E,$B49,'1. Costs linked to activities'!$D:$D,E$15)+SUMIFS('2. Communication Costs'!$K:$K,'2. Communication Costs'!$E:$E,'Breakdown & Project Funding'!$B49,'2. Communication Costs'!$D:$D,'Breakdown & Project Funding'!E$15)+SUMIFS('3. Travel & Subsistence costs'!$R:$R,'3. Travel & Subsistence costs'!$E:$E,'Breakdown & Project Funding'!$B49,'3. Travel & Subsistence costs'!$D:$D,'Breakdown & Project Funding'!E$15)+SUMIFS('4. Personnel  costs'!$W:$W,'4. Personnel  costs'!$E:$E,'Breakdown & Project Funding'!$B49,'4. Personnel  costs'!$D:$D,'Breakdown & Project Funding'!E$15)+SUMIFS('5. Indirect Costs'!$J:$J,'5. Indirect Costs'!$E:$E,'Breakdown & Project Funding'!$B49,'5. Indirect Costs'!$D:$D,'Breakdown & Project Funding'!E$15)","v":0},{"$f":"SUMIFS('1. Costs linked to activities'!$K:$K,'1. Costs linked to activities'!$E:$E,$B49,'1. Costs linked to activities'!$D:$D,F$15)+SUMIFS('2. Communication Costs'!$K:$K,'2. Communication Costs'!$E:$E,'Breakdown & Project Funding'!$B49,'2. Communication Costs'!$D:$D,'Breakdown & Project Funding'!F$15)+SUMIFS('3. Travel & Subsistence costs'!$R:$R,'3. Travel & Subsistence costs'!$E:$E,'Breakdown & Project Funding'!$B49,'3. Travel & Subsistence costs'!$D:$D,'Breakdown & Project Funding'!F$15)+SUMIFS('4. Personnel  costs'!$W:$W,'4. Personnel  costs'!$E:$E,'Breakdown & Project Funding'!$B49,'4. Personnel  costs'!$D:$D,'Breakdown & Project Funding'!F$15)+SUMIFS('5. Indirect Costs'!$J:$J,'5. Indirect Costs'!$E:$E,'Breakdown & Project Funding'!$B49,'5. Indirect Costs'!$D:$D,'Breakdown & Project Funding'!F$15)","v":0},{"$f":"SUMIFS('1. Costs linked to activities'!$K:$K,'1. Costs linked to activities'!$E:$E,$B49,'1. Costs linked to activities'!$D:$D,G$15)+SUMIFS('2. Communication Costs'!$K:$K,'2. Communication Costs'!$E:$E,'Breakdown & Project Funding'!$B49,'2. Communication Costs'!$D:$D,'Breakdown & Project Funding'!G$15)+SUMIFS('3. Travel & Subsistence costs'!$R:$R,'3. Travel & Subsistence costs'!$E:$E,'Breakdown & Project Funding'!$B49,'3. Travel & Subsistence costs'!$D:$D,'Breakdown & Project Funding'!G$15)+SUMIFS('4. Personnel  costs'!$W:$W,'4. Personnel  costs'!$E:$E,'Breakdown & Project Funding'!$B49,'4. Personnel  costs'!$D:$D,'Breakdown & Project Funding'!G$15)+SUMIFS('5. Indirect Costs'!$J:$J,'5. Indirect Costs'!$E:$E,'Breakdown & Project Funding'!$B49,'5. Indirect Costs'!$D:$D,'Breakdown & Project Funding'!G$15)","v":0},0]
[null,"P35",{"$f":"SUMIFS('1. Costs linked to activities'!$K:$K,'1. Costs linked to activities'!$E:$E,$B50,'1. Costs linked to activities'!$D:$D,C$15)+SUMIFS('2. Communication Costs'!$K:$K,'2. Communication Costs'!$E:$E,'Breakdown & Project Funding'!$B50,'2. Communication Costs'!$D:$D,'Breakdown & Project Funding'!C$15)+SUMIFS('3. Travel & Subsistence costs'!$R:$R,'3. Travel & Subsistence costs'!$E:$E,'Breakdown & Project Funding'!$B50,'3. Travel & Subsistence costs'!$D:$D,'Breakdown & Project Funding'!C$15)+SUMIFS('4. Personnel  costs'!$W:$W,'4. Personnel  costs'!$E:$E,'Breakdown & Project Funding'!$B50,'4. Personnel  costs'!$D:$D,'Breakdown & Project Funding'!C$15)+SUMIFS('5. Indirect Costs'!$J:$J,'5. Indirect Costs'!$E:$E,'Breakdown & Project Funding'!$B50,'5. Indirect Costs'!$D:$D,'Breakdown & Project Funding'!C$15)","v":0},{"$f":"SUMIFS('1. Costs linked to activities'!$K:$K,'1. Costs linked to activities'!$E:$E,$B50,'1. Costs linked to activities'!$D:$D,D$15)+SUMIFS('2. Communication Costs'!$K:$K,'2. Communication Costs'!$E:$E,'Breakdown & Project Funding'!$B50,'2. Communication Costs'!$D:$D,'Breakdown & Project Funding'!D$15)+SUMIFS('3. Travel & Subsistence costs'!$R:$R,'3. Travel & Subsistence costs'!$E:$E,'Breakdown & Project Funding'!$B50,'3. Travel & Subsistence costs'!$D:$D,'Breakdown & Project Funding'!D$15)+SUMIFS('4. Personnel  costs'!$W:$W,'4. Personnel  costs'!$E:$E,'Breakdown & Project Funding'!$B50,'4. Personnel  costs'!$D:$D,'Breakdown & Project Funding'!D$15)+SUMIFS('5. Indirect Costs'!$J:$J,'5. Indirect Costs'!$E:$E,'Breakdown & Project Funding'!$B50,'5. Indirect Costs'!$D:$D,'Breakdown & Project Funding'!D$15)","v":0},{"$f":"SUMIFS('1. Costs linked to activities'!$K:$K,'1. Costs linked to activities'!$E:$E,$B50,'1. Costs linked to activities'!$D:$D,E$15)+SUMIFS('2. Communication Costs'!$K:$K,'2. Communication Costs'!$E:$E,'Breakdown & Project Funding'!$B50,'2. Communication Costs'!$D:$D,'Breakdown & Project Funding'!E$15)+SUMIFS('3. Travel & Subsistence costs'!$R:$R,'3. Travel & Subsistence costs'!$E:$E,'Breakdown & Project Funding'!$B50,'3. Travel & Subsistence costs'!$D:$D,'Breakdown & Project Funding'!E$15)+SUMIFS('4. Personnel  costs'!$W:$W,'4. Personnel  costs'!$E:$E,'Breakdown & Project Funding'!$B50,'4. Personnel  costs'!$D:$D,'Breakdown & Project Funding'!E$15)+SUMIFS('5. Indirect Costs'!$J:$J,'5. Indirect Costs'!$E:$E,'Breakdown & Project Funding'!$B50,'5. Indirect Costs'!$D:$D,'Breakdown & Project Funding'!E$15)","v":0},{"$f":"SUMIFS('1. Costs linked to activities'!$K:$K,'1. Costs linked to activities'!$E:$E,$B50,'1. Costs linked to activities'!$D:$D,F$15)+SUMIFS('2. Communication Costs'!$K:$K,'2. Communication Costs'!$E:$E,'Breakdown & Project Funding'!$B50,'2. Communication Costs'!$D:$D,'Breakdown & Project Funding'!F$15)+SUMIFS('3. Travel & Subsistence costs'!$R:$R,'3. Travel & Subsistence costs'!$E:$E,'Breakdown & Project Funding'!$B50,'3. Travel & Subsistence costs'!$D:$D,'Breakdown & Project Funding'!F$15)+SUMIFS('4. Personnel  costs'!$W:$W,'4. Personnel  costs'!$E:$E,'Breakdown & Project Funding'!$B50,'4. Personnel  costs'!$D:$D,'Breakdown & Project Funding'!F$15)+SUMIFS('5. Indirect Costs'!$J:$J,'5. Indirect Costs'!$E:$E,'Breakdown & Project Funding'!$B50,'5. Indirect Costs'!$D:$D,'Breakdown & Project Funding'!F$15)","v":0},{"$f":"SUMIFS('1. Costs linked to activities'!$K:$K,'1. Costs linked to activities'!$E:$E,$B50,'1. Costs linked to activities'!$D:$D,G$15)+SUMIFS('2. Communication Costs'!$K:$K,'2. Communication Costs'!$E:$E,'Breakdown & Project Funding'!$B50,'2. Communication Costs'!$D:$D,'Breakdown & Project Funding'!G$15)+SUMIFS('3. Travel & Subsistence costs'!$R:$R,'3. Travel & Subsistence costs'!$E:$E,'Breakdown & Project Funding'!$B50,'3. Travel & Subsistence costs'!$D:$D,'Breakdown & Project Funding'!G$15)+SUMIFS('4. Personnel  costs'!$W:$W,'4. Personnel  costs'!$E:$E,'Breakdown & Project Funding'!$B50,'4. Personnel  costs'!$D:$D,'Breakdown & Project Funding'!G$15)+SUMIFS('5. Indirect Costs'!$J:$J,'5. Indirect Costs'!$E:$E,'Breakdown & Project Funding'!$B50,'5. Indirect Costs'!$D:$D,'Breakdown & Project Funding'!G$15)","v":0},0]
[null,"P36",{"$f":"SUMIFS('1. Costs linked to activities'!$K:$K,'1. Costs linked to activities'!$E:$E,$B51,'1. Costs linked to activities'!$D:$D,C$15)+SUMIFS('2. Communication Costs'!$K:$K,'2. Communication Costs'!$E:$E,'Breakdown & Project Funding'!$B51,'2. Communication Costs'!$D:$D,'Breakdown & Project Funding'!C$15)+SUMIFS('3. Travel & Subsistence costs'!$R:$R,'3. Travel & Subsistence costs'!$E:$E,'Breakdown & Project Funding'!$B51,'3. Travel & Subsistence costs'!$D:$D,'Breakdown & Project Funding'!C$15)+SUMIFS('4. Personnel  costs'!$W:$W,'4. Personnel  costs'!$E:$E,'Breakdown & Project Funding'!$B51,'4. Personnel  costs'!$D:$D,'Breakdown & Project Funding'!C$15)+SUMIFS('5. Indirect Costs'!$J:$J,'5. Indirect Costs'!$E:$E,'Breakdown & Project Funding'!$B51,'5. Indirect Costs'!$D:$D,'Breakdown & Project Funding'!C$15)","v":0},{"$f":"SUMIFS('1. Costs linked to activities'!$K:$K,'1. Costs linked to activities'!$E:$E,$B51,'1. Costs linked to activities'!$D:$D,D$15)+SUMIFS('2. Communication Costs'!$K:$K,'2. Communication Costs'!$E:$E,'Breakdown & Project Funding'!$B51,'2. Communication Costs'!$D:$D,'Breakdown & Project Funding'!D$15)+SUMIFS('3. Travel & Subsistence costs'!$R:$R,'3. Travel & Subsistence costs'!$E:$E,'Breakdown & Project Funding'!$B51,'3. Travel & Subsistence costs'!$D:$D,'Breakdown & Project Funding'!D$15)+SUMIFS('4. Personnel  costs'!$W:$W,'4. Personnel  costs'!$E:$E,'Breakdown & Project Funding'!$B51,'4. Personnel  costs'!$D:$D,'Breakdown & Project Funding'!D$15)+SUMIFS('5. Indirect Costs'!$J:$J,'5. Indirect Costs'!$E:$E,'Breakdown & Project Funding'!$B51,'5. Indirect Costs'!$D:$D,'Breakdown & Project Funding'!D$15)","v":0},{"$f":"SUMIFS('1. Costs linked to activities'!$K:$K,'1. Costs linked to activities'!$E:$E,$B51,'1. Costs linked to activities'!$D:$D,E$15)+SUMIFS('2. Communication Costs'!$K:$K,'2. Communication Costs'!$E:$E,'Breakdown & Project Funding'!$B51,'2. Communication Costs'!$D:$D,'Breakdown & Project Funding'!E$15)+SUMIFS('3. Travel & Subsistence costs'!$R:$R,'3. Travel & Subsistence costs'!$E:$E,'Breakdown & Project Funding'!$B51,'3. Travel & Subsistence costs'!$D:$D,'Breakdown & Project Funding'!E$15)+SUMIFS('4. Personnel  costs'!$W:$W,'4. Personnel  costs'!$E:$E,'Breakdown & Project Funding'!$B51,'4. Personnel  costs'!$D:$D,'Breakdown & Project Funding'!E$15)+SUMIFS('5. Indirect Costs'!$J:$J,'5. Indirect Costs'!$E:$E,'Breakdown & Project Funding'!$B51,'5. Indirect Costs'!$D:$D,'Breakdown & Project Funding'!E$15)","v":0},{"$f":"SUMIFS('1. Costs linked to activities'!$K:$K,'1. Costs linked to activities'!$E:$E,$B51,'1. Costs linked to activities'!$D:$D,F$15)+SUMIFS('2. Communication Costs'!$K:$K,'2. Communication Costs'!$E:$E,'Breakdown & Project Funding'!$B51,'2. Communication Costs'!$D:$D,'Breakdown & Project Funding'!F$15)+SUMIFS('3. Travel & Subsistence costs'!$R:$R,'3. Travel & Subsistence costs'!$E:$E,'Breakdown & Project Funding'!$B51,'3. Travel & Subsistence costs'!$D:$D,'Breakdown & Project Funding'!F$15)+SUMIFS('4. Personnel  costs'!$W:$W,'4. Personnel  costs'!$E:$E,'Breakdown & Project Funding'!$B51,'4. Personnel  costs'!$D:$D,'Breakdown & Project Funding'!F$15)+SUMIFS('5. Indirect Costs'!$J:$J,'5. Indirect Costs'!$E:$E,'Breakdown & Project Funding'!$B51,'5. Indirect Costs'!$D:$D,'Breakdown & Project Funding'!F$15)","v":0},{"$f":"SUMIFS('1. Costs linked to activities'!$K:$K,'1. Costs linked to activities'!$E:$E,$B51,'1. Costs linked to activities'!$D:$D,G$15)+SUMIFS('2. Communication Costs'!$K:$K,'2. Communication Costs'!$E:$E,'Breakdown & Project Funding'!$B51,'2. Communication Costs'!$D:$D,'Breakdown & Project Funding'!G$15)+SUMIFS('3. Travel & Subsistence costs'!$R:$R,'3. Travel & Subsistence costs'!$E:$E,'Breakdown & Project Funding'!$B51,'3. Travel & Subsistence costs'!$D:$D,'Breakdown & Project Funding'!G$15)+SUMIFS('4. Personnel  costs'!$W:$W,'4. Personnel  costs'!$E:$E,'Breakdown & Project Funding'!$B51,'4. Personnel  costs'!$D:$D,'Breakdown & Project Funding'!G$15)+SUMIFS('5. Indirect Costs'!$J:$J,'5. Indirect Costs'!$E:$E,'Breakdown & Project Funding'!$B51,'5. Indirect Costs'!$D:$D,'Breakdown & Project Funding'!G$15)","v":0},0]
[null,"P37",{"$f":"SUMIFS('1. Costs linked to activities'!$K:$K,'1. Costs linked to activities'!$E:$E,$B52,'1. Costs linked to activities'!$D:$D,C$15)+SUMIFS('2. Communication Costs'!$K:$K,'2. Communication Costs'!$E:$E,'Breakdown & Project Funding'!$B52,'2. Communication Costs'!$D:$D,'Breakdown & Project Funding'!C$15)+SUMIFS('3. Travel & Subsistence costs'!$R:$R,'3. Travel & Subsistence costs'!$E:$E,'Breakdown & Project Funding'!$B52,'3. Travel & Subsistence costs'!$D:$D,'Breakdown & Project Funding'!C$15)+SUMIFS('4. Personnel  costs'!$W:$W,'4. Personnel  costs'!$E:$E,'Breakdown & Project Funding'!$B52,'4. Personnel  costs'!$D:$D,'Breakdown & Project Funding'!C$15)+SUMIFS('5. Indirect Costs'!$J:$J,'5. Indirect Costs'!$E:$E,'Breakdown & Project Funding'!$B52,'5. Indirect Costs'!$D:$D,'Breakdown & Project Funding'!C$15)","v":0},{"$f":"SUMIFS('1. Costs linked to activities'!$K:$K,'1. Costs linked to activities'!$E:$E,$B52,'1. Costs linked to activities'!$D:$D,D$15)+SUMIFS('2. Communication Costs'!$K:$K,'2. Communication Costs'!$E:$E,'Breakdown & Project Funding'!$B52,'2. Communication Costs'!$D:$D,'Breakdown & Project Funding'!D$15)+SUMIFS('3. Travel & Subsistence costs'!$R:$R,'3. Travel & Subsistence costs'!$E:$E,'Breakdown & Project Funding'!$B52,'3. Travel & Subsistence costs'!$D:$D,'Breakdown & Project Funding'!D$15)+SUMIFS('4. Personnel  costs'!$W:$W,'4. Personnel  costs'!$E:$E,'Breakdown & Project Funding'!$B52,'4. Personnel  costs'!$D:$D,'Breakdown & Project Funding'!D$15)+SUMIFS('5. Indirect Costs'!$J:$J,'5. Indirect Costs'!$E:$E,'Breakdown & Project Funding'!$B52,'5. Indirect Costs'!$D:$D,'Breakdown & Project Funding'!D$15)","v":0},{"$f":"SUMIFS('1. Costs linked to activities'!$K:$K,'1. Costs linked to activities'!$E:$E,$B52,'1. Costs linked to activities'!$D:$D,E$15)+SUMIFS('2. Communication Costs'!$K:$K,'2. Communication Costs'!$E:$E,'Breakdown & Project Funding'!$B52,'2. Communication Costs'!$D:$D,'Breakdown & Project Funding'!E$15)+SUMIFS('3. Travel & Subsistence costs'!$R:$R,'3. Travel & Subsistence costs'!$E:$E,'Breakdown & Project Funding'!$B52,'3. Travel & Subsistence costs'!$D:$D,'Breakdown & Project Funding'!E$15)+SUMIFS('4. Personnel  costs'!$W:$W,'4. Personnel  costs'!$E:$E,'Breakdown & Project Funding'!$B52,'4. Personnel  costs'!$D:$D,'Breakdown & Project Funding'!E$15)+SUMIFS('5. Indirect Costs'!$J:$J,'5. Indirect Costs'!$E:$E,'Breakdown & Project Funding'!$B52,'5. Indirect Costs'!$D:$D,'Breakdown & Project Funding'!E$15)","v":0},{"$f":"SUMIFS('1. Costs linked to activities'!$K:$K,'1. Costs linked to activities'!$E:$E,$B52,'1. Costs linked to activities'!$D:$D,F$15)+SUMIFS('2. Communication Costs'!$K:$K,'2. Communication Costs'!$E:$E,'Breakdown & Project Funding'!$B52,'2. Communication Costs'!$D:$D,'Breakdown & Project Funding'!F$15)+SUMIFS('3. Travel & Subsistence costs'!$R:$R,'3. Travel & Subsistence costs'!$E:$E,'Breakdown & Project Funding'!$B52,'3. Travel & Subsistence costs'!$D:$D,'Breakdown & Project Funding'!F$15)+SUMIFS('4. Personnel  costs'!$W:$W,'4. Personnel  costs'!$E:$E,'Breakdown & Project Funding'!$B52,'4. Personnel  costs'!$D:$D,'Breakdown & Project Funding'!F$15)+SUMIFS('5. Indirect Costs'!$J:$J,'5. Indirect Costs'!$E:$E,'Breakdown & Project Funding'!$B52,'5. Indirect Costs'!$D:$D,'Breakdown & Project Funding'!F$15)","v":0},{"$f":"SUMIFS('1. Costs linked to activities'!$K:$K,'1. Costs linked to activities'!$E:$E,$B52,'1. Costs linked to activities'!$D:$D,G$15)+SUMIFS('2. Communication Costs'!$K:$K,'2. Communication Costs'!$E:$E,'Breakdown & Project Funding'!$B52,'2. Communication Costs'!$D:$D,'Breakdown & Project Funding'!G$15)+SUMIFS('3. Travel & Subsistence costs'!$R:$R,'3. Travel & Subsistence costs'!$E:$E,'Breakdown & Project Funding'!$B52,'3. Travel & Subsistence costs'!$D:$D,'Breakdown & Project Funding'!G$15)+SUMIFS('4. Personnel  costs'!$W:$W,'4. Personnel  costs'!$E:$E,'Breakdown & Project Funding'!$B52,'4. Personnel  costs'!$D:$D,'Breakdown & Project Funding'!G$15)+SUMIFS('5. Indirect Costs'!$J:$J,'5. Indirect Costs'!$E:$E,'Breakdown & Project Funding'!$B52,'5. Indirect Costs'!$D:$D,'Breakdown & Project Funding'!G$15)","v":0},0]
[null,"P38",{"$f":"SUMIFS('1. Costs linked to activities'!$K:$K,'1. Costs linked to activities'!$E:$E,$B53,'1. Costs linked to activities'!$D:$D,C$15)+SUMIFS('2. Communication Costs'!$K:$K,'2. Communication Costs'!$E:$E,'Breakdown & Project Funding'!$B53,'2. Communication Costs'!$D:$D,'Breakdown & Project Funding'!C$15)+SUMIFS('3. Travel & Subsistence costs'!$R:$R,'3. Travel & Subsistence costs'!$E:$E,'Breakdown & Project Funding'!$B53,'3. Travel & Subsistence costs'!$D:$D,'Breakdown & Project Funding'!C$15)+SUMIFS('4. Personnel  costs'!$W:$W,'4. Personnel  costs'!$E:$E,'Breakdown & Project Funding'!$B53,'4. Personnel  costs'!$D:$D,'Breakdown & Project Funding'!C$15)+SUMIFS('5. Indirect Costs'!$J:$J,'5. Indirect Costs'!$E:$E,'Breakdown & Project Funding'!$B53,'5. Indirect Costs'!$D:$D,'Breakdown & Project Funding'!C$15)","v":0},{"$f":"SUMIFS('1. Costs linked to activities'!$K:$K,'1. Costs linked to activities'!$E:$E,$B53,'1. Costs linked to activities'!$D:$D,D$15)+SUMIFS('2. Communication Costs'!$K:$K,'2. Communication Costs'!$E:$E,'Breakdown & Project Funding'!$B53,'2. Communication Costs'!$D:$D,'Breakdown & Project Funding'!D$15)+SUMIFS('3. Travel & Subsistence costs'!$R:$R,'3. Travel & Subsistence costs'!$E:$E,'Breakdown & Project Funding'!$B53,'3. Travel & Subsistence costs'!$D:$D,'Breakdown & Project Funding'!D$15)+SUMIFS('4. Personnel  costs'!$W:$W,'4. Personnel  costs'!$E:$E,'Breakdown & Project Funding'!$B53,'4. Personnel  costs'!$D:$D,'Breakdown & Project Funding'!D$15)+SUMIFS('5. Indirect Costs'!$J:$J,'5. Indirect Costs'!$E:$E,'Breakdown & Project Funding'!$B53,'5. Indirect Costs'!$D:$D,'Breakdown & Project Funding'!D$15)","v":0},{"$f":"SUMIFS('1. Costs linked to activities'!$K:$K,'1. Costs linked to activities'!$E:$E,$B53,'1. Costs linked to activities'!$D:$D,E$15)+SUMIFS('2. Communication Costs'!$K:$K,'2. Communication Costs'!$E:$E,'Breakdown & Project Funding'!$B53,'2. Communication Costs'!$D:$D,'Breakdown & Project Funding'!E$15)+SUMIFS('3. Travel & Subsistence costs'!$R:$R,'3. Travel & Subsistence costs'!$E:$E,'Breakdown & Project Funding'!$B53,'3. Travel & Subsistence costs'!$D:$D,'Breakdown & Project Funding'!E$15)+SUMIFS('4. Personnel  costs'!$W:$W,'4. Personnel  costs'!$E:$E,'Breakdown & Project Funding'!$B53,'4. Personnel  costs'!$D:$D,'Breakdown & Project Funding'!E$15)+SUMIFS('5. Indirect Costs'!$J:$J,'5. Indirect Costs'!$E:$E,'Breakdown & Project Funding'!$B53,'5. Indirect Costs'!$D:$D,'Breakdown & Project Funding'!E$15)","v":0},{"$f":"SUMIFS('1. Costs linked to activities'!$K:$K,'1. Costs linked to activities'!$E:$E,$B53,'1. Costs linked to activities'!$D:$D,F$15)+SUMIFS('2. Communication Costs'!$K:$K,'2. Communication Costs'!$E:$E,'Breakdown & Project Funding'!$B53,'2. Communication Costs'!$D:$D,'Breakdown & Project Funding'!F$15)+SUMIFS('3. Travel & Subsistence costs'!$R:$R,'3. Travel & Subsistence costs'!$E:$E,'Breakdown & Project Funding'!$B53,'3. Travel & Subsistence costs'!$D:$D,'Breakdown & Project Funding'!F$15)+SUMIFS('4. Personnel  costs'!$W:$W,'4. Personnel  costs'!$E:$E,'Breakdown & Project Funding'!$B53,'4. Personnel  costs'!$D:$D,'Breakdown & Project Funding'!F$15)+SUMIFS('5. Indirect Costs'!$J:$J,'5. Indirect Costs'!$E:$E,'Breakdown & Project Funding'!$B53,'5. Indirect Costs'!$D:$D,'Breakdown & Project Funding'!F$15)","v":0},{"$f":"SUMIFS('1. Costs linked to activities'!$K:$K,'1. Costs linked to activities'!$E:$E,$B53,'1. Costs linked to activities'!$D:$D,G$15)+SUMIFS('2. Communication Costs'!$K:$K,'2. Communication Costs'!$E:$E,'Breakdown & Project Funding'!$B53,'2. Communication Costs'!$D:$D,'Breakdown & Project Funding'!G$15)+SUMIFS('3. Travel & Subsistence costs'!$R:$R,'3. Travel & Subsistence costs'!$E:$E,'Breakdown & Project Funding'!$B53,'3. Travel & Subsistence costs'!$D:$D,'Breakdown & Project Funding'!G$15)+SUMIFS('4. Personnel  costs'!$W:$W,'4. Personnel  costs'!$E:$E,'Breakdown & Project Funding'!$B53,'4. Personnel  costs'!$D:$D,'Breakdown & Project Funding'!G$15)+SUMIFS('5. Indirect Costs'!$J:$J,'5. Indirect Costs'!$E:$E,'Breakdown & Project Funding'!$B53,'5. Indirect Costs'!$D:$D,'Breakdown & Project Funding'!G$15)","v":0},0]
[null,"P39",{"$f":"SUMIFS('1. Costs linked to activities'!$K:$K,'1. Costs linked to activities'!$E:$E,$B54,'1. Costs linked to activities'!$D:$D,C$15)+SUMIFS('2. Communication Costs'!$K:$K,'2. Communication Costs'!$E:$E,'Breakdown & Project Funding'!$B54,'2. Communication Costs'!$D:$D,'Breakdown & Project Funding'!C$15)+SUMIFS('3. Travel & Subsistence costs'!$R:$R,'3. Travel & Subsistence costs'!$E:$E,'Breakdown & Project Funding'!$B54,'3. Travel & Subsistence costs'!$D:$D,'Breakdown & Project Funding'!C$15)+SUMIFS('4. Personnel  costs'!$W:$W,'4. Personnel  costs'!$E:$E,'Breakdown & Project Funding'!$B54,'4. Personnel  costs'!$D:$D,'Breakdown & Project Funding'!C$15)+SUMIFS('5. Indirect Costs'!$J:$J,'5. Indirect Costs'!$E:$E,'Breakdown & Project Funding'!$B54,'5. Indirect Costs'!$D:$D,'Breakdown & Project Funding'!C$15)","v":0},{"$f":"SUMIFS('1. Costs linked to activities'!$K:$K,'1. Costs linked to activities'!$E:$E,$B54,'1. Costs linked to activities'!$D:$D,D$15)+SUMIFS('2. Communication Costs'!$K:$K,'2. Communication Costs'!$E:$E,'Breakdown & Project Funding'!$B54,'2. Communication Costs'!$D:$D,'Breakdown & Project Funding'!D$15)+SUMIFS('3. Travel & Subsistence costs'!$R:$R,'3. Travel & Subsistence costs'!$E:$E,'Breakdown & Project Funding'!$B54,'3. Travel & Subsistence costs'!$D:$D,'Breakdown & Project Funding'!D$15)+SUMIFS('4. Personnel  costs'!$W:$W,'4. Personnel  costs'!$E:$E,'Breakdown & Project Funding'!$B54,'4. Personnel  costs'!$D:$D,'Breakdown & Project Funding'!D$15)+SUMIFS('5. Indirect Costs'!$J:$J,'5. Indirect Costs'!$E:$E,'Breakdown & Project Funding'!$B54,'5. Indirect Costs'!$D:$D,'Breakdown & Project Funding'!D$15)","v":0},{"$f":"SUMIFS('1. Costs linked to activities'!$K:$K,'1. Costs linked to activities'!$E:$E,$B54,'1. Costs linked to activities'!$D:$D,E$15)+SUMIFS('2. Communication Costs'!$K:$K,'2. Communication Costs'!$E:$E,'Breakdown & Project Funding'!$B54,'2. Communication Costs'!$D:$D,'Breakdown & Project Funding'!E$15)+SUMIFS('3. Travel & Subsistence costs'!$R:$R,'3. Travel & Subsistence costs'!$E:$E,'Breakdown & Project Funding'!$B54,'3. Travel & Subsistence costs'!$D:$D,'Breakdown & Project Funding'!E$15)+SUMIFS('4. Personnel  costs'!$W:$W,'4. Personnel  costs'!$E:$E,'Breakdown & Project Funding'!$B54,'4. Personnel  costs'!$D:$D,'Breakdown & Project Funding'!E$15)+SUMIFS('5. Indirect Costs'!$J:$J,'5. Indirect Costs'!$E:$E,'Breakdown & Project Funding'!$B54,'5. Indirect Costs'!$D:$D,'Breakdown & Project Funding'!E$15)","v":0},{"$f":"SUMIFS('1. Costs linked to activities'!$K:$K,'1. Costs linked to activities'!$E:$E,$B54,'1. Costs linked to activities'!$D:$D,F$15)+SUMIFS('2. Communication Costs'!$K:$K,'2. Communication Costs'!$E:$E,'Breakdown & Project Funding'!$B54,'2. Communication Costs'!$D:$D,'Breakdown & Project Funding'!F$15)+SUMIFS('3. Travel & Subsistence costs'!$R:$R,'3. Travel & Subsistence costs'!$E:$E,'Breakdown & Project Funding'!$B54,'3. Travel & Subsistence costs'!$D:$D,'Breakdown & Project Funding'!F$15)+SUMIFS('4. Personnel  costs'!$W:$W,'4. Personnel  costs'!$E:$E,'Breakdown & Project Funding'!$B54,'4. Personnel  costs'!$D:$D,'Breakdown & Project Funding'!F$15)+SUMIFS('5. Indirect Costs'!$J:$J,'5. Indirect Costs'!$E:$E,'Breakdown & Project Funding'!$B54,'5. Indirect Costs'!$D:$D,'Breakdown & Project Funding'!F$15)","v":0},{"$f":"SUMIFS('1. Costs linked to activities'!$K:$K,'1. Costs linked to activities'!$E:$E,$B54,'1. Costs linked to activities'!$D:$D,G$15)+SUMIFS('2. Communication Costs'!$K:$K,'2. Communication Costs'!$E:$E,'Breakdown & Project Funding'!$B54,'2. Communication Costs'!$D:$D,'Breakdown & Project Funding'!G$15)+SUMIFS('3. Travel & Subsistence costs'!$R:$R,'3. Travel & Subsistence costs'!$E:$E,'Breakdown & Project Funding'!$B54,'3. Travel & Subsistence costs'!$D:$D,'Breakdown & Project Funding'!G$15)+SUMIFS('4. Personnel  costs'!$W:$W,'4. Personnel  costs'!$E:$E,'Breakdown & Project Funding'!$B54,'4. Personnel  costs'!$D:$D,'Breakdown & Project Funding'!G$15)+SUMIFS('5. Indirect Costs'!$J:$J,'5. Indirect Costs'!$E:$E,'Breakdown & Project Funding'!$B54,'5. Indirect Costs'!$D:$D,'Breakdown & Project Funding'!G$15)","v":0},0]
[null,"P40",{"$f":"SUMIFS('1. Costs linked to activities'!$K:$K,'1. Costs linked to activities'!$E:$E,$B55,'1. Costs linked to activities'!$D:$D,C$15)+SUMIFS('2. Communication Costs'!$K:$K,'2. Communication Costs'!$E:$E,'Breakdown & Project Funding'!$B55,'2. Communication Costs'!$D:$D,'Breakdown & Project Funding'!C$15)+SUMIFS('3. Travel & Subsistence costs'!$R:$R,'3. Travel & Subsistence costs'!$E:$E,'Breakdown & Project Funding'!$B55,'3. Travel & Subsistence costs'!$D:$D,'Breakdown & Project Funding'!C$15)+SUMIFS('4. Personnel  costs'!$W:$W,'4. Personnel  costs'!$E:$E,'Breakdown & Project Funding'!$B55,'4. Personnel  costs'!$D:$D,'Breakdown & Project Funding'!C$15)+SUMIFS('5. Indirect Costs'!$J:$J,'5. Indirect Costs'!$E:$E,'Breakdown & Project Funding'!$B55,'5. Indirect Costs'!$D:$D,'Breakdown & Project Funding'!C$15)","v":0},{"$f":"SUMIFS('1. Costs linked to activities'!$K:$K,'1. Costs linked to activities'!$E:$E,$B55,'1. Costs linked to activities'!$D:$D,D$15)+SUMIFS('2. Communication Costs'!$K:$K,'2. Communication Costs'!$E:$E,'Breakdown & Project Funding'!$B55,'2. Communication Costs'!$D:$D,'Breakdown & Project Funding'!D$15)+SUMIFS('3. Travel & Subsistence costs'!$R:$R,'3. Travel & Subsistence costs'!$E:$E,'Breakdown & Project Funding'!$B55,'3. Travel & Subsistence costs'!$D:$D,'Breakdown & Project Funding'!D$15)+SUMIFS('4. Personnel  costs'!$W:$W,'4. Personnel  costs'!$E:$E,'Breakdown & Project Funding'!$B55,'4. Personnel  costs'!$D:$D,'Breakdown & Project Funding'!D$15)+SUMIFS('5. Indirect Costs'!$J:$J,'5. Indirect Costs'!$E:$E,'Breakdown & Project Funding'!$B55,'5. Indirect Costs'!$D:$D,'Breakdown & Project Funding'!D$15)","v":0},{"$f":"SUMIFS('1. Costs linked to activities'!$K:$K,'1. Costs linked to activities'!$E:$E,$B55,'1. Costs linked to activities'!$D:$D,E$15)+SUMIFS('2. Communication Costs'!$K:$K,'2. Communication Costs'!$E:$E,'Breakdown & Project Funding'!$B55,'2. Communication Costs'!$D:$D,'Breakdown & Project Funding'!E$15)+SUMIFS('3. Travel & Subsistence costs'!$R:$R,'3. Travel & Subsistence costs'!$E:$E,'Breakdown & Project Funding'!$B55,'3. Travel & Subsistence costs'!$D:$D,'Breakdown & Project Funding'!E$15)+SUMIFS('4. Personnel  costs'!$W:$W,'4. Personnel  costs'!$E:$E,'Breakdown & Project Funding'!$B55,'4. Personnel  costs'!$D:$D,'Breakdown & Project Funding'!E$15)+SUMIFS('5. Indirect Costs'!$J:$J,'5. Indirect Costs'!$E:$E,'Breakdown & Project Funding'!$B55,'5. Indirect Costs'!$D:$D,'Breakdown & Project Funding'!E$15)","v":0},{"$f":"SUMIFS('1. Costs linked to activities'!$K:$K,'1. Costs linked to activities'!$E:$E,$B55,'1. Costs linked to activities'!$D:$D,F$15)+SUMIFS('2. Communication Costs'!$K:$K,'2. Communication Costs'!$E:$E,'Breakdown & Project Funding'!$B55,'2. Communication Costs'!$D:$D,'Breakdown & Project Funding'!F$15)+SUMIFS('3. Travel & Subsistence costs'!$R:$R,'3. Travel & Subsistence costs'!$E:$E,'Breakdown & Project Funding'!$B55,'3. Travel & Subsistence costs'!$D:$D,'Breakdown & Project Funding'!F$15)+SUMIFS('4. Personnel  costs'!$W:$W,'4. Personnel  costs'!$E:$E,'Breakdown & Project Funding'!$B55,'4. Personnel  costs'!$D:$D,'Breakdown & Project Funding'!F$15)+SUMIFS('5. Indirect Costs'!$J:$J,'5. Indirect Costs'!$E:$E,'Breakdown & Project Funding'!$B55,'5. Indirect Costs'!$D:$D,'Breakdown & Project Funding'!F$15)","v":0},{"$f":"SUMIFS('1. Costs linked to activities'!$K:$K,'1. Costs linked to activities'!$E:$E,$B55,'1. Costs linked to activities'!$D:$D,G$15)+SUMIFS('2. Communication Costs'!$K:$K,'2. Communication Costs'!$E:$E,'Breakdown & Project Funding'!$B55,'2. Communication Costs'!$D:$D,'Breakdown & Project Funding'!G$15)+SUMIFS('3. Travel & Subsistence costs'!$R:$R,'3. Travel & Subsistence costs'!$E:$E,'Breakdown & Project Funding'!$B55,'3. Travel & Subsistence costs'!$D:$D,'Breakdown & Project Funding'!G$15)+SUMIFS('4. Personnel  costs'!$W:$W,'4. Personnel  costs'!$E:$E,'Breakdown & Project Funding'!$B55,'4. Personnel  costs'!$D:$D,'Breakdown & Project Funding'!G$15)+SUMIFS('5. Indirect Costs'!$J:$J,'5. Indirect Costs'!$E:$E,'Breakdown & Project Funding'!$B55,'5. Indirect Costs'!$D:$D,'Breakdown & Project Funding'!G$15)","v":0},0]
[null,"P41",{"$f":"SUMIFS('1. Costs linked to activities'!$K:$K,'1. Costs linked to activities'!$E:$E,$B56,'1. Costs linked to activities'!$D:$D,C$15)+SUMIFS('2. Communication Costs'!$K:$K,'2. Communication Costs'!$E:$E,'Breakdown & Project Funding'!$B56,'2. Communication Costs'!$D:$D,'Breakdown & Project Funding'!C$15)+SUMIFS('3. Travel & Subsistence costs'!$R:$R,'3. Travel & Subsistence costs'!$E:$E,'Breakdown & Project Funding'!$B56,'3. Travel & Subsistence costs'!$D:$D,'Breakdown & Project Funding'!C$15)+SUMIFS('4. Personnel  costs'!$W:$W,'4. Personnel  costs'!$E:$E,'Breakdown & Project Funding'!$B56,'4. Personnel  costs'!$D:$D,'Breakdown & Project Funding'!C$15)+SUMIFS('5. Indirect Costs'!$J:$J,'5. Indirect Costs'!$E:$E,'Breakdown & Project Funding'!$B56,'5. Indirect Costs'!$D:$D,'Breakdown & Project Funding'!C$15)","v":0},{"$f":"SUMIFS('1. Costs linked to activities'!$K:$K,'1. Costs linked to activities'!$E:$E,$B56,'1. Costs linked to activities'!$D:$D,D$15)+SUMIFS('2. Communication Costs'!$K:$K,'2. Communication Costs'!$E:$E,'Breakdown & Project Funding'!$B56,'2. Communication Costs'!$D:$D,'Breakdown & Project Funding'!D$15)+SUMIFS('3. Travel & Subsistence costs'!$R:$R,'3. Travel & Subsistence costs'!$E:$E,'Breakdown & Project Funding'!$B56,'3. Travel & Subsistence costs'!$D:$D,'Breakdown & Project Funding'!D$15)+SUMIFS('4. Personnel  costs'!$W:$W,'4. Personnel  costs'!$E:$E,'Breakdown & Project Funding'!$B56,'4. Personnel  costs'!$D:$D,'Breakdown & Project Funding'!D$15)+SUMIFS('5. Indirect Costs'!$J:$J,'5. Indirect Costs'!$E:$E,'Breakdown & Project Funding'!$B56,'5. Indirect Costs'!$D:$D,'Breakdown & Project Funding'!D$15)","v":0},{"$f":"SUMIFS('1. Costs linked to activities'!$K:$K,'1. Costs linked to activities'!$E:$E,$B56,'1. Costs linked to activities'!$D:$D,E$15)+SUMIFS('2. Communication Costs'!$K:$K,'2. Communication Costs'!$E:$E,'Breakdown & Project Funding'!$B56,'2. Communication Costs'!$D:$D,'Breakdown & Project Funding'!E$15)+SUMIFS('3. Travel & Subsistence costs'!$R:$R,'3. Travel & Subsistence costs'!$E:$E,'Breakdown & Project Funding'!$B56,'3. Travel & Subsistence costs'!$D:$D,'Breakdown & Project Funding'!E$15)+SUMIFS('4. Personnel  costs'!$W:$W,'4. Personnel  costs'!$E:$E,'Breakdown & Project Funding'!$B56,'4. Personnel  costs'!$D:$D,'Breakdown & Project Funding'!E$15)+SUMIFS('5. Indirect Costs'!$J:$J,'5. Indirect Costs'!$E:$E,'Breakdown & Project Funding'!$B56,'5. Indirect Costs'!$D:$D,'Breakdown & Project Funding'!E$15)","v":0},{"$f":"SUMIFS('1. Costs linked to activities'!$K:$K,'1. Costs linked to activities'!$E:$E,$B56,'1. Costs linked to activities'!$D:$D,F$15)+SUMIFS('2. Communication Costs'!$K:$K,'2. Communication Costs'!$E:$E,'Breakdown & Project Funding'!$B56,'2. Communication Costs'!$D:$D,'Breakdown & Project Funding'!F$15)+SUMIFS('3. Travel & Subsistence costs'!$R:$R,'3. Travel & Subsistence costs'!$E:$E,'Breakdown & Project Funding'!$B56,'3. Travel & Subsistence costs'!$D:$D,'Breakdown & Project Funding'!F$15)+SUMIFS('4. Personnel  costs'!$W:$W,'4. Personnel  costs'!$E:$E,'Breakdown & Project Funding'!$B56,'4. Personnel  costs'!$D:$D,'Breakdown & Project Funding'!F$15)+SUMIFS('5. Indirect Costs'!$J:$J,'5. Indirect Costs'!$E:$E,'Breakdown & Project Funding'!$B56,'5. Indirect Costs'!$D:$D,'Breakdown & Project Funding'!F$15)","v":0},{"$f":"SUMIFS('1. Costs linked to activities'!$K:$K,'1. Costs linked to activities'!$E:$E,$B56,'1. Costs linked to activities'!$D:$D,G$15)+SUMIFS('2. Communication Costs'!$K:$K,'2. Communication Costs'!$E:$E,'Breakdown & Project Funding'!$B56,'2. Communication Costs'!$D:$D,'Breakdown & Project Funding'!G$15)+SUMIFS('3. Travel & Subsistence costs'!$R:$R,'3. Travel & Subsistence costs'!$E:$E,'Breakdown & Project Funding'!$B56,'3. Travel & Subsistence costs'!$D:$D,'Breakdown & Project Funding'!G$15)+SUMIFS('4. Personnel  costs'!$W:$W,'4. Personnel  costs'!$E:$E,'Breakdown & Project Funding'!$B56,'4. Personnel  costs'!$D:$D,'Breakdown & Project Funding'!G$15)+SUMIFS('5. Indirect Costs'!$J:$J,'5. Indirect Costs'!$E:$E,'Breakdown & Project Funding'!$B56,'5. Indirect Costs'!$D:$D,'Breakdown & Project Funding'!G$15)","v":0},0]
[null,"P42",{"$f":"SUMIFS('1. Costs linked to activities'!$K:$K,'1. Costs linked to activities'!$E:$E,$B57,'1. Costs linked to activities'!$D:$D,C$15)+SUMIFS('2. Communication Costs'!$K:$K,'2. Communication Costs'!$E:$E,'Breakdown & Project Funding'!$B57,'2. Communication Costs'!$D:$D,'Breakdown & Project Funding'!C$15)+SUMIFS('3. Travel & Subsistence costs'!$R:$R,'3. Travel & Subsistence costs'!$E:$E,'Breakdown & Project Funding'!$B57,'3. Travel & Subsistence costs'!$D:$D,'Breakdown & Project Funding'!C$15)+SUMIFS('4. Personnel  costs'!$W:$W,'4. Personnel  costs'!$E:$E,'Breakdown & Project Funding'!$B57,'4. Personnel  costs'!$D:$D,'Breakdown & Project Funding'!C$15)+SUMIFS('5. Indirect Costs'!$J:$J,'5. Indirect Costs'!$E:$E,'Breakdown & Project Funding'!$B57,'5. Indirect Costs'!$D:$D,'Breakdown & Project Funding'!C$15)","v":0},{"$f":"SUMIFS('1. Costs linked to activities'!$K:$K,'1. Costs linked to activities'!$E:$E,$B57,'1. Costs linked to activities'!$D:$D,D$15)+SUMIFS('2. Communication Costs'!$K:$K,'2. Communication Costs'!$E:$E,'Breakdown & Project Funding'!$B57,'2. Communication Costs'!$D:$D,'Breakdown & Project Funding'!D$15)+SUMIFS('3. Travel & Subsistence costs'!$R:$R,'3. Travel & Subsistence costs'!$E:$E,'Breakdown & Project Funding'!$B57,'3. Travel & Subsistence costs'!$D:$D,'Breakdown & Project Funding'!D$15)+SUMIFS('4. Personnel  costs'!$W:$W,'4. Personnel  costs'!$E:$E,'Breakdown & Project Funding'!$B57,'4. Personnel  costs'!$D:$D,'Breakdown & Project Funding'!D$15)+SUMIFS('5. Indirect Costs'!$J:$J,'5. Indirect Costs'!$E:$E,'Breakdown & Project Funding'!$B57,'5. Indirect Costs'!$D:$D,'Breakdown & Project Funding'!D$15)","v":0},{"$f":"SUMIFS('1. Costs linked to activities'!$K:$K,'1. Costs linked to activities'!$E:$E,$B57,'1. Costs linked to activities'!$D:$D,E$15)+SUMIFS('2. Communication Costs'!$K:$K,'2. Communication Costs'!$E:$E,'Breakdown & Project Funding'!$B57,'2. Communication Costs'!$D:$D,'Breakdown & Project Funding'!E$15)+SUMIFS('3. Travel & Subsistence costs'!$R:$R,'3. Travel & Subsistence costs'!$E:$E,'Breakdown & Project Funding'!$B57,'3. Travel & Subsistence costs'!$D:$D,'Breakdown & Project Funding'!E$15)+SUMIFS('4. Personnel  costs'!$W:$W,'4. Personnel  costs'!$E:$E,'Breakdown & Project Funding'!$B57,'4. Personnel  costs'!$D:$D,'Breakdown & Project Funding'!E$15)+SUMIFS('5. Indirect Costs'!$J:$J,'5. Indirect Costs'!$E:$E,'Breakdown & Project Funding'!$B57,'5. Indirect Costs'!$D:$D,'Breakdown & Project Funding'!E$15)","v":0},{"$f":"SUMIFS('1. Costs linked to activities'!$K:$K,'1. Costs linked to activities'!$E:$E,$B57,'1. Costs linked to activities'!$D:$D,F$15)+SUMIFS('2. Communication Costs'!$K:$K,'2. Communication Costs'!$E:$E,'Breakdown & Project Funding'!$B57,'2. Communication Costs'!$D:$D,'Breakdown & Project Funding'!F$15)+SUMIFS('3. Travel & Subsistence costs'!$R:$R,'3. Travel & Subsistence costs'!$E:$E,'Breakdown & Project Funding'!$B57,'3. Travel & Subsistence costs'!$D:$D,'Breakdown & Project Funding'!F$15)+SUMIFS('4. Personnel  costs'!$W:$W,'4. Personnel  costs'!$E:$E,'Breakdown & Project Funding'!$B57,'4. Personnel  costs'!$D:$D,'Breakdown & Project Funding'!F$15)+SUMIFS('5. Indirect Costs'!$J:$J,'5. Indirect Costs'!$E:$E,'Breakdown & Project Funding'!$B57,'5. Indirect Costs'!$D:$D,'Breakdown & Project Funding'!F$15)","v":0},{"$f":"SUMIFS('1. Costs linked to activities'!$K:$K,'1. Costs linked to activities'!$E:$E,$B57,'1. Costs linked to activities'!$D:$D,G$15)+SUMIFS('2. Communication Costs'!$K:$K,'2. Communication Costs'!$E:$E,'Breakdown & Project Funding'!$B57,'2. Communication Costs'!$D:$D,'Breakdown & Project Funding'!G$15)+SUMIFS('3. Travel & Subsistence costs'!$R:$R,'3. Travel & Subsistence costs'!$E:$E,'Breakdown & Project Funding'!$B57,'3. Travel & Subsistence costs'!$D:$D,'Breakdown & Project Funding'!G$15)+SUMIFS('4. Personnel  costs'!$W:$W,'4. Personnel  costs'!$E:$E,'Breakdown & Project Funding'!$B57,'4. Personnel  costs'!$D:$D,'Breakdown & Project Funding'!G$15)+SUMIFS('5. Indirect Costs'!$J:$J,'5. Indirect Costs'!$E:$E,'Breakdown & Project Funding'!$B57,'5. Indirect Costs'!$D:$D,'Breakdown & Project Funding'!G$15)","v":0},0]
[null,"P43",{"$f":"SUMIFS('1. Costs linked to activities'!$K:$K,'1. Costs linked to activities'!$E:$E,$B58,'1. Costs linked to activities'!$D:$D,C$15)+SUMIFS('2. Communication Costs'!$K:$K,'2. Communication Costs'!$E:$E,'Breakdown & Project Funding'!$B58,'2. Communication Costs'!$D:$D,'Breakdown & Project Funding'!C$15)+SUMIFS('3. Travel & Subsistence costs'!$R:$R,'3. Travel & Subsistence costs'!$E:$E,'Breakdown & Project Funding'!$B58,'3. Travel & Subsistence costs'!$D:$D,'Breakdown & Project Funding'!C$15)+SUMIFS('4. Personnel  costs'!$W:$W,'4. Personnel  costs'!$E:$E,'Breakdown & Project Funding'!$B58,'4. Personnel  costs'!$D:$D,'Breakdown & Project Funding'!C$15)+SUMIFS('5. Indirect Costs'!$J:$J,'5. Indirect Costs'!$E:$E,'Breakdown & Project Funding'!$B58,'5. Indirect Costs'!$D:$D,'Breakdown & Project Funding'!C$15)","v":0},{"$f":"SUMIFS('1. Costs linked to activities'!$K:$K,'1. Costs linked to activities'!$E:$E,$B58,'1. Costs linked to activities'!$D:$D,D$15)+SUMIFS('2. Communication Costs'!$K:$K,'2. Communication Costs'!$E:$E,'Breakdown & Project Funding'!$B58,'2. Communication Costs'!$D:$D,'Breakdown & Project Funding'!D$15)+SUMIFS('3. Travel & Subsistence costs'!$R:$R,'3. Travel & Subsistence costs'!$E:$E,'Breakdown & Project Funding'!$B58,'3. Travel & Subsistence costs'!$D:$D,'Breakdown & Project Funding'!D$15)+SUMIFS('4. Personnel  costs'!$W:$W,'4. Personnel  costs'!$E:$E,'Breakdown & Project Funding'!$B58,'4. Personnel  costs'!$D:$D,'Breakdown & Project Funding'!D$15)+SUMIFS('5. Indirect Costs'!$J:$J,'5. Indirect Costs'!$E:$E,'Breakdown & Project Funding'!$B58,'5. Indirect Costs'!$D:$D,'Breakdown & Project Funding'!D$15)","v":0},{"$f":"SUMIFS('1. Costs linked to activities'!$K:$K,'1. Costs linked to activities'!$E:$E,$B58,'1. Costs linked to activities'!$D:$D,E$15)+SUMIFS('2. Communication Costs'!$K:$K,'2. Communication Costs'!$E:$E,'Breakdown & Project Funding'!$B58,'2. Communication Costs'!$D:$D,'Breakdown & Project Funding'!E$15)+SUMIFS('3. Travel & Subsistence costs'!$R:$R,'3. Travel & Subsistence costs'!$E:$E,'Breakdown & Project Funding'!$B58,'3. Travel & Subsistence costs'!$D:$D,'Breakdown & Project Funding'!E$15)+SUMIFS('4. Personnel  costs'!$W:$W,'4. Personnel  costs'!$E:$E,'Breakdown & Project Funding'!$B58,'4. Personnel  costs'!$D:$D,'Breakdown & Project Funding'!E$15)+SUMIFS('5. Indirect Costs'!$J:$J,'5. Indirect Costs'!$E:$E,'Breakdown & Project Funding'!$B58,'5. Indirect Costs'!$D:$D,'Breakdown & Project Funding'!E$15)","v":0},{"$f":"SUMIFS('1. Costs linked to activities'!$K:$K,'1. Costs linked to activities'!$E:$E,$B58,'1. Costs linked to activities'!$D:$D,F$15)+SUMIFS('2. Communication Costs'!$K:$K,'2. Communication Costs'!$E:$E,'Breakdown & Project Funding'!$B58,'2. Communication Costs'!$D:$D,'Breakdown & Project Funding'!F$15)+SUMIFS('3. Travel & Subsistence costs'!$R:$R,'3. Travel & Subsistence costs'!$E:$E,'Breakdown & Project Funding'!$B58,'3. Travel & Subsistence costs'!$D:$D,'Breakdown & Project Funding'!F$15)+SUMIFS('4. Personnel  costs'!$W:$W,'4. Personnel  costs'!$E:$E,'Breakdown & Project Funding'!$B58,'4. Personnel  costs'!$D:$D,'Breakdown & Project Funding'!F$15)+SUMIFS('5. Indirect Costs'!$J:$J,'5. Indirect Costs'!$E:$E,'Breakdown & Project Funding'!$B58,'5. Indirect Costs'!$D:$D,'Breakdown & Project Funding'!F$15)","v":0},{"$f":"SUMIFS('1. Costs linked to activities'!$K:$K,'1. Costs linked to activities'!$E:$E,$B58,'1. Costs linked to activities'!$D:$D,G$15)+SUMIFS('2. Communication Costs'!$K:$K,'2. Communication Costs'!$E:$E,'Breakdown & Project Funding'!$B58,'2. Communication Costs'!$D:$D,'Breakdown & Project Funding'!G$15)+SUMIFS('3. Travel & Subsistence costs'!$R:$R,'3. Travel & Subsistence costs'!$E:$E,'Breakdown & Project Funding'!$B58,'3. Travel & Subsistence costs'!$D:$D,'Breakdown & Project Funding'!G$15)+SUMIFS('4. Personnel  costs'!$W:$W,'4. Personnel  costs'!$E:$E,'Breakdown & Project Funding'!$B58,'4. Personnel  costs'!$D:$D,'Breakdown & Project Funding'!G$15)+SUMIFS('5. Indirect Costs'!$J:$J,'5. Indirect Costs'!$E:$E,'Breakdown & Project Funding'!$B58,'5. Indirect Costs'!$D:$D,'Breakdown & Project Funding'!G$15)","v":0},0]
[null,"P44",{"$f":"SUMIFS('1. Costs linked to activities'!$K:$K,'1. Costs linked to activities'!$E:$E,$B59,'1. Costs linked to activities'!$D:$D,C$15)+SUMIFS('2. Communication Costs'!$K:$K,'2. Communication Costs'!$E:$E,'Breakdown & Project Funding'!$B59,'2. Communication Costs'!$D:$D,'Breakdown & Project Funding'!C$15)+SUMIFS('3. Travel & Subsistence costs'!$R:$R,'3. Travel & Subsistence costs'!$E:$E,'Breakdown & Project Funding'!$B59,'3. Travel & Subsistence costs'!$D:$D,'Breakdown & Project Funding'!C$15)+SUMIFS('4. Personnel  costs'!$W:$W,'4. Personnel  costs'!$E:$E,'Breakdown & Project Funding'!$B59,'4. Personnel  costs'!$D:$D,'Breakdown & Project Funding'!C$15)+SUMIFS('5. Indirect Costs'!$J:$J,'5. Indirect Costs'!$E:$E,'Breakdown & Project Funding'!$B59,'5. Indirect Costs'!$D:$D,'Breakdown & Project Funding'!C$15)","v":0},{"$f":"SUMIFS('1. Costs linked to activities'!$K:$K,'1. Costs linked to activities'!$E:$E,$B59,'1. Costs linked to activities'!$D:$D,D$15)+SUMIFS('2. Communication Costs'!$K:$K,'2. Communication Costs'!$E:$E,'Breakdown & Project Funding'!$B59,'2. Communication Costs'!$D:$D,'Breakdown & Project Funding'!D$15)+SUMIFS('3. Travel & Subsistence costs'!$R:$R,'3. Travel & Subsistence costs'!$E:$E,'Breakdown & Project Funding'!$B59,'3. Travel & Subsistence costs'!$D:$D,'Breakdown & Project Funding'!D$15)+SUMIFS('4. Personnel  costs'!$W:$W,'4. Personnel  costs'!$E:$E,'Breakdown & Project Funding'!$B59,'4. Personnel  costs'!$D:$D,'Breakdown & Project Funding'!D$15)+SUMIFS('5. Indirect Costs'!$J:$J,'5. Indirect Costs'!$E:$E,'Breakdown & Project Funding'!$B59,'5. Indirect Costs'!$D:$D,'Breakdown & Project Funding'!D$15)","v":0},{"$f":"SUMIFS('1. Costs linked to activities'!$K:$K,'1. Costs linked to activities'!$E:$E,$B59,'1. Costs linked to activities'!$D:$D,E$15)+SUMIFS('2. Communication Costs'!$K:$K,'2. Communication Costs'!$E:$E,'Breakdown & Project Funding'!$B59,'2. Communication Costs'!$D:$D,'Breakdown & Project Funding'!E$15)+SUMIFS('3. Travel & Subsistence costs'!$R:$R,'3. Travel & Subsistence costs'!$E:$E,'Breakdown & Project Funding'!$B59,'3. Travel & Subsistence costs'!$D:$D,'Breakdown & Project Funding'!E$15)+SUMIFS('4. Personnel  costs'!$W:$W,'4. Personnel  costs'!$E:$E,'Breakdown & Project Funding'!$B59,'4. Personnel  costs'!$D:$D,'Breakdown & Project Funding'!E$15)+SUMIFS('5. Indirect Costs'!$J:$J,'5. Indirect Costs'!$E:$E,'Breakdown & Project Funding'!$B59,'5. Indirect Costs'!$D:$D,'Breakdown & Project Funding'!E$15)","v":0},{"$f":"SUMIFS('1. Costs linked to activities'!$K:$K,'1. Costs linked to activities'!$E:$E,$B59,'1. Costs linked to activities'!$D:$D,F$15)+SUMIFS('2. Communication Costs'!$K:$K,'2. Communication Costs'!$E:$E,'Breakdown & Project Funding'!$B59,'2. Communication Costs'!$D:$D,'Breakdown & Project Funding'!F$15)+SUMIFS('3. Travel & Subsistence costs'!$R:$R,'3. Travel & Subsistence costs'!$E:$E,'Breakdown & Project Funding'!$B59,'3. Travel & Subsistence costs'!$D:$D,'Breakdown & Project Funding'!F$15)+SUMIFS('4. Personnel  costs'!$W:$W,'4. Personnel  costs'!$E:$E,'Breakdown & Project Funding'!$B59,'4. Personnel  costs'!$D:$D,'Breakdown & Project Funding'!F$15)+SUMIFS('5. Indirect Costs'!$J:$J,'5. Indirect Costs'!$E:$E,'Breakdown & Project Funding'!$B59,'5. Indirect Costs'!$D:$D,'Breakdown & Project Funding'!F$15)","v":0},{"$f":"SUMIFS('1. Costs linked to activities'!$K:$K,'1. Costs linked to activities'!$E:$E,$B59,'1. Costs linked to activities'!$D:$D,G$15)+SUMIFS('2. Communication Costs'!$K:$K,'2. Communication Costs'!$E:$E,'Breakdown & Project Funding'!$B59,'2. Communication Costs'!$D:$D,'Breakdown & Project Funding'!G$15)+SUMIFS('3. Travel & Subsistence costs'!$R:$R,'3. Travel & Subsistence costs'!$E:$E,'Breakdown & Project Funding'!$B59,'3. Travel & Subsistence costs'!$D:$D,'Breakdown & Project Funding'!G$15)+SUMIFS('4. Personnel  costs'!$W:$W,'4. Personnel  costs'!$E:$E,'Breakdown & Project Funding'!$B59,'4. Personnel  costs'!$D:$D,'Breakdown & Project Funding'!G$15)+SUMIFS('5. Indirect Costs'!$J:$J,'5. Indirect Costs'!$E:$E,'Breakdown & Project Funding'!$B59,'5. Indirect Costs'!$D:$D,'Breakdown & Project Funding'!G$15)","v":0},0]
[null,"P45",{"$f":"SUMIFS('1. Costs linked to activities'!$K:$K,'1. Costs linked to activities'!$E:$E,$B60,'1. Costs linked to activities'!$D:$D,C$15)+SUMIFS('2. Communication Costs'!$K:$K,'2. Communication Costs'!$E:$E,'Breakdown & Project Funding'!$B60,'2. Communication Costs'!$D:$D,'Breakdown & Project Funding'!C$15)+SUMIFS('3. Travel & Subsistence costs'!$R:$R,'3. Travel & Subsistence costs'!$E:$E,'Breakdown & Project Funding'!$B60,'3. Travel & Subsistence costs'!$D:$D,'Breakdown & Project Funding'!C$15)+SUMIFS('4. Personnel  costs'!$W:$W,'4. Personnel  costs'!$E:$E,'Breakdown & Project Funding'!$B60,'4. Personnel  costs'!$D:$D,'Breakdown & Project Funding'!C$15)+SUMIFS('5. Indirect Costs'!$J:$J,'5. Indirect Costs'!$E:$E,'Breakdown & Project Funding'!$B60,'5. Indirect Costs'!$D:$D,'Breakdown & Project Funding'!C$15)","v":0},{"$f":"SUMIFS('1. Costs linked to activities'!$K:$K,'1. Costs linked to activities'!$E:$E,$B60,'1. Costs linked to activities'!$D:$D,D$15)+SUMIFS('2. Communication Costs'!$K:$K,'2. Communication Costs'!$E:$E,'Breakdown & Project Funding'!$B60,'2. Communication Costs'!$D:$D,'Breakdown & Project Funding'!D$15)+SUMIFS('3. Travel & Subsistence costs'!$R:$R,'3. Travel & Subsistence costs'!$E:$E,'Breakdown & Project Funding'!$B60,'3. Travel & Subsistence costs'!$D:$D,'Breakdown & Project Funding'!D$15)+SUMIFS('4. Personnel  costs'!$W:$W,'4. Personnel  costs'!$E:$E,'Breakdown & Project Funding'!$B60,'4. Personnel  costs'!$D:$D,'Breakdown & Project Funding'!D$15)+SUMIFS('5. Indirect Costs'!$J:$J,'5. Indirect Costs'!$E:$E,'Breakdown & Project Funding'!$B60,'5. Indirect Costs'!$D:$D,'Breakdown & Project Funding'!D$15)","v":0},{"$f":"SUMIFS('1. Costs linked to activities'!$K:$K,'1. Costs linked to activities'!$E:$E,$B60,'1. Costs linked to activities'!$D:$D,E$15)+SUMIFS('2. Communication Costs'!$K:$K,'2. Communication Costs'!$E:$E,'Breakdown & Project Funding'!$B60,'2. Communication Costs'!$D:$D,'Breakdown & Project Funding'!E$15)+SUMIFS('3. Travel & Subsistence costs'!$R:$R,'3. Travel & Subsistence costs'!$E:$E,'Breakdown & Project Funding'!$B60,'3. Travel & Subsistence costs'!$D:$D,'Breakdown & Project Funding'!E$15)+SUMIFS('4. Personnel  costs'!$W:$W,'4. Personnel  costs'!$E:$E,'Breakdown & Project Funding'!$B60,'4. Personnel  costs'!$D:$D,'Breakdown & Project Funding'!E$15)+SUMIFS('5. Indirect Costs'!$J:$J,'5. Indirect Costs'!$E:$E,'Breakdown & Project Funding'!$B60,'5. Indirect Costs'!$D:$D,'Breakdown & Project Funding'!E$15)","v":0},{"$f":"SUMIFS('1. Costs linked to activities'!$K:$K,'1. Costs linked to activities'!$E:$E,$B60,'1. Costs linked to activities'!$D:$D,F$15)+SUMIFS('2. Communication Costs'!$K:$K,'2. Communication Costs'!$E:$E,'Breakdown & Project Funding'!$B60,'2. Communication Costs'!$D:$D,'Breakdown & Project Funding'!F$15)+SUMIFS('3. Travel & Subsistence costs'!$R:$R,'3. Travel & Subsistence costs'!$E:$E,'Breakdown & Project Funding'!$B60,'3. Travel & Subsistence costs'!$D:$D,'Breakdown & Project Funding'!F$15)+SUMIFS('4. Personnel  costs'!$W:$W,'4. Personnel  costs'!$E:$E,'Breakdown & Project Funding'!$B60,'4. Personnel  costs'!$D:$D,'Breakdown & Project Funding'!F$15)+SUMIFS('5. Indirect Costs'!$J:$J,'5. Indirect Costs'!$E:$E,'Breakdown & Project Funding'!$B60,'5. Indirect Costs'!$D:$D,'Breakdown & Project Funding'!F$15)","v":0},{"$f":"SUMIFS('1. Costs linked to activities'!$K:$K,'1. Costs linked to activities'!$E:$E,$B60,'1. Costs linked to activities'!$D:$D,G$15)+SUMIFS('2. Communication Costs'!$K:$K,'2. Communication Costs'!$E:$E,'Breakdown & Project Funding'!$B60,'2. Communication Costs'!$D:$D,'Breakdown & Project Funding'!G$15)+SUMIFS('3. Travel & Subsistence costs'!$R:$R,'3. Travel & Subsistence costs'!$E:$E,'Breakdown & Project Funding'!$B60,'3. Travel & Subsistence costs'!$D:$D,'Breakdown & Project Funding'!G$15)+SUMIFS('4. Personnel  costs'!$W:$W,'4. Personnel  costs'!$E:$E,'Breakdown & Project Funding'!$B60,'4. Personnel  costs'!$D:$D,'Breakdown & Project Funding'!G$15)+SUMIFS('5. Indirect Costs'!$J:$J,'5. Indirect Costs'!$E:$E,'Breakdown & Project Funding'!$B60,'5. Indirect Costs'!$D:$D,'Breakdown & Project Funding'!G$15)","v":0},0]
[null,"P46",{"$f":"SUMIFS('1. Costs linked to activities'!$K:$K,'1. Costs linked to activities'!$E:$E,$B61,'1. Costs linked to activities'!$D:$D,C$15)+SUMIFS('2. Communication Costs'!$K:$K,'2. Communication Costs'!$E:$E,'Breakdown & Project Funding'!$B61,'2. Communication Costs'!$D:$D,'Breakdown & Project Funding'!C$15)+SUMIFS('3. Travel & Subsistence costs'!$R:$R,'3. Travel & Subsistence costs'!$E:$E,'Breakdown & Project Funding'!$B61,'3. Travel & Subsistence costs'!$D:$D,'Breakdown & Project Funding'!C$15)+SUMIFS('4. Personnel  costs'!$W:$W,'4. Personnel  costs'!$E:$E,'Breakdown & Project Funding'!$B61,'4. Personnel  costs'!$D:$D,'Breakdown & Project Funding'!C$15)+SUMIFS('5. Indirect Costs'!$J:$J,'5. Indirect Costs'!$E:$E,'Breakdown & Project Funding'!$B61,'5. Indirect Costs'!$D:$D,'Breakdown & Project Funding'!C$15)","v":0},{"$f":"SUMIFS('1. Costs linked to activities'!$K:$K,'1. Costs linked to activities'!$E:$E,$B61,'1. Costs linked to activities'!$D:$D,D$15)+SUMIFS('2. Communication Costs'!$K:$K,'2. Communication Costs'!$E:$E,'Breakdown & Project Funding'!$B61,'2. Communication Costs'!$D:$D,'Breakdown & Project Funding'!D$15)+SUMIFS('3. Travel & Subsistence costs'!$R:$R,'3. Travel & Subsistence costs'!$E:$E,'Breakdown & Project Funding'!$B61,'3. Travel & Subsistence costs'!$D:$D,'Breakdown & Project Funding'!D$15)+SUMIFS('4. Personnel  costs'!$W:$W,'4. Personnel  costs'!$E:$E,'Breakdown & Project Funding'!$B61,'4. Personnel  costs'!$D:$D,'Breakdown & Project Funding'!D$15)+SUMIFS('5. Indirect Costs'!$J:$J,'5. Indirect Costs'!$E:$E,'Breakdown & Project Funding'!$B61,'5. Indirect Costs'!$D:$D,'Breakdown & Project Funding'!D$15)","v":0},{"$f":"SUMIFS('1. Costs linked to activities'!$K:$K,'1. Costs linked to activities'!$E:$E,$B61,'1. Costs linked to activities'!$D:$D,E$15)+SUMIFS('2. Communication Costs'!$K:$K,'2. Communication Costs'!$E:$E,'Breakdown & Project Funding'!$B61,'2. Communication Costs'!$D:$D,'Breakdown & Project Funding'!E$15)+SUMIFS('3. Travel & Subsistence costs'!$R:$R,'3. Travel & Subsistence costs'!$E:$E,'Breakdown & Project Funding'!$B61,'3. Travel & Subsistence costs'!$D:$D,'Breakdown & Project Funding'!E$15)+SUMIFS('4. Personnel  costs'!$W:$W,'4. Personnel  costs'!$E:$E,'Breakdown & Project Funding'!$B61,'4. Personnel  costs'!$D:$D,'Breakdown & Project Funding'!E$15)+SUMIFS('5. Indirect Costs'!$J:$J,'5. Indirect Costs'!$E:$E,'Breakdown & Project Funding'!$B61,'5. Indirect Costs'!$D:$D,'Breakdown & Project Funding'!E$15)","v":0},{"$f":"SUMIFS('1. Costs linked to activities'!$K:$K,'1. Costs linked to activities'!$E:$E,$B61,'1. Costs linked to activities'!$D:$D,F$15)+SUMIFS('2. Communication Costs'!$K:$K,'2. Communication Costs'!$E:$E,'Breakdown & Project Funding'!$B61,'2. Communication Costs'!$D:$D,'Breakdown & Project Funding'!F$15)+SUMIFS('3. Travel & Subsistence costs'!$R:$R,'3. Travel & Subsistence costs'!$E:$E,'Breakdown & Project Funding'!$B61,'3. Travel & Subsistence costs'!$D:$D,'Breakdown & Project Funding'!F$15)+SUMIFS('4. Personnel  costs'!$W:$W,'4. Personnel  costs'!$E:$E,'Breakdown & Project Funding'!$B61,'4. Personnel  costs'!$D:$D,'Breakdown & Project Funding'!F$15)+SUMIFS('5. Indirect Costs'!$J:$J,'5. Indirect Costs'!$E:$E,'Breakdown & Project Funding'!$B61,'5. Indirect Costs'!$D:$D,'Breakdown & Project Funding'!F$15)","v":0},{"$f":"SUMIFS('1. Costs linked to activities'!$K:$K,'1. Costs linked to activities'!$E:$E,$B61,'1. Costs linked to activities'!$D:$D,G$15)+SUMIFS('2. Communication Costs'!$K:$K,'2. Communication Costs'!$E:$E,'Breakdown & Project Funding'!$B61,'2. Communication Costs'!$D:$D,'Breakdown & Project Funding'!G$15)+SUMIFS('3. Travel & Subsistence costs'!$R:$R,'3. Travel & Subsistence costs'!$E:$E,'Breakdown & Project Funding'!$B61,'3. Travel & Subsistence costs'!$D:$D,'Breakdown & Project Funding'!G$15)+SUMIFS('4. Personnel  costs'!$W:$W,'4. Personnel  costs'!$E:$E,'Breakdown & Project Funding'!$B61,'4. Personnel  costs'!$D:$D,'Breakdown & Project Funding'!G$15)+SUMIFS('5. Indirect Costs'!$J:$J,'5. Indirect Costs'!$E:$E,'Breakdown & Project Funding'!$B61,'5. Indirect Costs'!$D:$D,'Breakdown & Project Funding'!G$15)","v":0},0]
[null,"P47",{"$f":"SUMIFS('1. Costs linked to activities'!$K:$K,'1. Costs linked to activities'!$E:$E,$B62,'1. Costs linked to activities'!$D:$D,C$15)+SUMIFS('2. Communication Costs'!$K:$K,'2. Communication Costs'!$E:$E,'Breakdown & Project Funding'!$B62,'2. Communication Costs'!$D:$D,'Breakdown & Project Funding'!C$15)+SUMIFS('3. Travel & Subsistence costs'!$R:$R,'3. Travel & Subsistence costs'!$E:$E,'Breakdown & Project Funding'!$B62,'3. Travel & Subsistence costs'!$D:$D,'Breakdown & Project Funding'!C$15)+SUMIFS('4. Personnel  costs'!$W:$W,'4. Personnel  costs'!$E:$E,'Breakdown & Project Funding'!$B62,'4. Personnel  costs'!$D:$D,'Breakdown & Project Funding'!C$15)+SUMIFS('5. Indirect Costs'!$J:$J,'5. Indirect Costs'!$E:$E,'Breakdown & Project Funding'!$B62,'5. Indirect Costs'!$D:$D,'Breakdown & Project Funding'!C$15)","v":0},{"$f":"SUMIFS('1. Costs linked to activities'!$K:$K,'1. Costs linked to activities'!$E:$E,$B62,'1. Costs linked to activities'!$D:$D,D$15)+SUMIFS('2. Communication Costs'!$K:$K,'2. Communication Costs'!$E:$E,'Breakdown & Project Funding'!$B62,'2. Communication Costs'!$D:$D,'Breakdown & Project Funding'!D$15)+SUMIFS('3. Travel & Subsistence costs'!$R:$R,'3. Travel & Subsistence costs'!$E:$E,'Breakdown & Project Funding'!$B62,'3. Travel & Subsistence costs'!$D:$D,'Breakdown & Project Funding'!D$15)+SUMIFS('4. Personnel  costs'!$W:$W,'4. Personnel  costs'!$E:$E,'Breakdown & Project Funding'!$B62,'4. Personnel  costs'!$D:$D,'Breakdown & Project Funding'!D$15)+SUMIFS('5. Indirect Costs'!$J:$J,'5. Indirect Costs'!$E:$E,'Breakdown & Project Funding'!$B62,'5. Indirect Costs'!$D:$D,'Breakdown & Project Funding'!D$15)","v":0},{"$f":"SUMIFS('1. Costs linked to activities'!$K:$K,'1. Costs linked to activities'!$E:$E,$B62,'1. Costs linked to activities'!$D:$D,E$15)+SUMIFS('2. Communication Costs'!$K:$K,'2. Communication Costs'!$E:$E,'Breakdown & Project Funding'!$B62,'2. Communication Costs'!$D:$D,'Breakdown & Project Funding'!E$15)+SUMIFS('3. Travel & Subsistence costs'!$R:$R,'3. Travel & Subsistence costs'!$E:$E,'Breakdown & Project Funding'!$B62,'3. Travel & Subsistence costs'!$D:$D,'Breakdown & Project Funding'!E$15)+SUMIFS('4. Personnel  costs'!$W:$W,'4. Personnel  costs'!$E:$E,'Breakdown & Project Funding'!$B62,'4. Personnel  costs'!$D:$D,'Breakdown & Project Funding'!E$15)+SUMIFS('5. Indirect Costs'!$J:$J,'5. Indirect Costs'!$E:$E,'Breakdown & Project Funding'!$B62,'5. Indirect Costs'!$D:$D,'Breakdown & Project Funding'!E$15)","v":0},{"$f":"SUMIFS('1. Costs linked to activities'!$K:$K,'1. Costs linked to activities'!$E:$E,$B62,'1. Costs linked to activities'!$D:$D,F$15)+SUMIFS('2. Communication Costs'!$K:$K,'2. Communication Costs'!$E:$E,'Breakdown & Project Funding'!$B62,'2. Communication Costs'!$D:$D,'Breakdown & Project Funding'!F$15)+SUMIFS('3. Travel & Subsistence costs'!$R:$R,'3. Travel & Subsistence costs'!$E:$E,'Breakdown & Project Funding'!$B62,'3. Travel & Subsistence costs'!$D:$D,'Breakdown & Project Funding'!F$15)+SUMIFS('4. Personnel  costs'!$W:$W,'4. Personnel  costs'!$E:$E,'Breakdown & Project Funding'!$B62,'4. Personnel  costs'!$D:$D,'Breakdown & Project Funding'!F$15)+SUMIFS('5. Indirect Costs'!$J:$J,'5. Indirect Costs'!$E:$E,'Breakdown & Project Funding'!$B62,'5. Indirect Costs'!$D:$D,'Breakdown & Project Funding'!F$15)","v":0},{"$f":"SUMIFS('1. Costs linked to activities'!$K:$K,'1. Costs linked to activities'!$E:$E,$B62,'1. Costs linked to activities'!$D:$D,G$15)+SUMIFS('2. Communication Costs'!$K:$K,'2. Communication Costs'!$E:$E,'Breakdown & Project Funding'!$B62,'2. Communication Costs'!$D:$D,'Breakdown & Project Funding'!G$15)+SUMIFS('3. Travel & Subsistence costs'!$R:$R,'3. Travel & Subsistence costs'!$E:$E,'Breakdown & Project Funding'!$B62,'3. Travel & Subsistence costs'!$D:$D,'Breakdown & Project Funding'!G$15)+SUMIFS('4. Personnel  costs'!$W:$W,'4. Personnel  costs'!$E:$E,'Breakdown & Project Funding'!$B62,'4. Personnel  costs'!$D:$D,'Breakdown & Project Funding'!G$15)+SUMIFS('5. Indirect Costs'!$J:$J,'5. Indirect Costs'!$E:$E,'Breakdown & Project Funding'!$B62,'5. Indirect Costs'!$D:$D,'Breakdown & Project Funding'!G$15)","v":0},0]
[null,"P48",{"$f":"SUMIFS('1. Costs linked to activities'!$K:$K,'1. Costs linked to activities'!$E:$E,$B63,'1. Costs linked to activities'!$D:$D,C$15)+SUMIFS('2. Communication Costs'!$K:$K,'2. Communication Costs'!$E:$E,'Breakdown & Project Funding'!$B63,'2. Communication Costs'!$D:$D,'Breakdown & Project Funding'!C$15)+SUMIFS('3. Travel & Subsistence costs'!$R:$R,'3. Travel & Subsistence costs'!$E:$E,'Breakdown & Project Funding'!$B63,'3. Travel & Subsistence costs'!$D:$D,'Breakdown & Project Funding'!C$15)+SUMIFS('4. Personnel  costs'!$W:$W,'4. Personnel  costs'!$E:$E,'Breakdown & Project Funding'!$B63,'4. Personnel  costs'!$D:$D,'Breakdown & Project Funding'!C$15)+SUMIFS('5. Indirect Costs'!$J:$J,'5. Indirect Costs'!$E:$E,'Breakdown & Project Funding'!$B63,'5. Indirect Costs'!$D:$D,'Breakdown & Project Funding'!C$15)","v":0},{"$f":"SUMIFS('1. Costs linked to activities'!$K:$K,'1. Costs linked to activities'!$E:$E,$B63,'1. Costs linked to activities'!$D:$D,D$15)+SUMIFS('2. Communication Costs'!$K:$K,'2. Communication Costs'!$E:$E,'Breakdown & Project Funding'!$B63,'2. Communication Costs'!$D:$D,'Breakdown & Project Funding'!D$15)+SUMIFS('3. Travel & Subsistence costs'!$R:$R,'3. Travel & Subsistence costs'!$E:$E,'Breakdown & Project Funding'!$B63,'3. Travel & Subsistence costs'!$D:$D,'Breakdown & Project Funding'!D$15)+SUMIFS('4. Personnel  costs'!$W:$W,'4. Personnel  costs'!$E:$E,'Breakdown & Project Funding'!$B63,'4. Personnel  costs'!$D:$D,'Breakdown & Project Funding'!D$15)+SUMIFS('5. Indirect Costs'!$J:$J,'5. Indirect Costs'!$E:$E,'Breakdown & Project Funding'!$B63,'5. Indirect Costs'!$D:$D,'Breakdown & Project Funding'!D$15)","v":0},{"$f":"SUMIFS('1. Costs linked to activities'!$K:$K,'1. Costs linked to activities'!$E:$E,$B63,'1. Costs linked to activities'!$D:$D,E$15)+SUMIFS('2. Communication Costs'!$K:$K,'2. Communication Costs'!$E:$E,'Breakdown & Project Funding'!$B63,'2. Communication Costs'!$D:$D,'Breakdown & Project Funding'!E$15)+SUMIFS('3. Travel & Subsistence costs'!$R:$R,'3. Travel & Subsistence costs'!$E:$E,'Breakdown & Project Funding'!$B63,'3. Travel & Subsistence costs'!$D:$D,'Breakdown & Project Funding'!E$15)+SUMIFS('4. Personnel  costs'!$W:$W,'4. Personnel  costs'!$E:$E,'Breakdown & Project Funding'!$B63,'4. Personnel  costs'!$D:$D,'Breakdown & Project Funding'!E$15)+SUMIFS('5. Indirect Costs'!$J:$J,'5. Indirect Costs'!$E:$E,'Breakdown & Project Funding'!$B63,'5. Indirect Costs'!$D:$D,'Breakdown & Project Funding'!E$15)","v":0},{"$f":"SUMIFS('1. Costs linked to activities'!$K:$K,'1. Costs linked to activities'!$E:$E,$B63,'1. Costs linked to activities'!$D:$D,F$15)+SUMIFS('2. Communication Costs'!$K:$K,'2. Communication Costs'!$E:$E,'Breakdown & Project Funding'!$B63,'2. Communication Costs'!$D:$D,'Breakdown & Project Funding'!F$15)+SUMIFS('3. Travel & Subsistence costs'!$R:$R,'3. Travel & Subsistence costs'!$E:$E,'Breakdown & Project Funding'!$B63,'3. Travel & Subsistence costs'!$D:$D,'Breakdown & Project Funding'!F$15)+SUMIFS('4. Personnel  costs'!$W:$W,'4. Personnel  costs'!$E:$E,'Breakdown & Project Funding'!$B63,'4. Personnel  costs'!$D:$D,'Breakdown & Project Funding'!F$15)+SUMIFS('5. Indirect Costs'!$J:$J,'5. Indirect Costs'!$E:$E,'Breakdown & Project Funding'!$B63,'5. Indirect Costs'!$D:$D,'Breakdown & Project Funding'!F$15)","v":0},{"$f":"SUMIFS('1. Costs linked to activities'!$K:$K,'1. Costs linked to activities'!$E:$E,$B63,'1. Costs linked to activities'!$D:$D,G$15)+SUMIFS('2. Communication Costs'!$K:$K,'2. Communication Costs'!$E:$E,'Breakdown & Project Funding'!$B63,'2. Communication Costs'!$D:$D,'Breakdown & Project Funding'!G$15)+SUMIFS('3. Travel & Subsistence costs'!$R:$R,'3. Travel & Subsistence costs'!$E:$E,'Breakdown & Project Funding'!$B63,'3. Travel & Subsistence costs'!$D:$D,'Breakdown & Project Funding'!G$15)+SUMIFS('4. Personnel  costs'!$W:$W,'4. Personnel  costs'!$E:$E,'Breakdown & Project Funding'!$B63,'4. Personnel  costs'!$D:$D,'Breakdown & Project Funding'!G$15)+SUMIFS('5. Indirect Costs'!$J:$J,'5. Indirect Costs'!$E:$E,'Breakdown & Project Funding'!$B63,'5. Indirect Costs'!$D:$D,'Breakdown & Project Funding'!G$15)","v":0},0]
[null,"P49",{"$f":"SUMIFS('1. Costs linked to activities'!$K:$K,'1. Costs linked to activities'!$E:$E,$B64,'1. Costs linked to activities'!$D:$D,C$15)+SUMIFS('2. Communication Costs'!$K:$K,'2. Communication Costs'!$E:$E,'Breakdown & Project Funding'!$B64,'2. Communication Costs'!$D:$D,'Breakdown & Project Funding'!C$15)+SUMIFS('3. Travel & Subsistence costs'!$R:$R,'3. Travel & Subsistence costs'!$E:$E,'Breakdown & Project Funding'!$B64,'3. Travel & Subsistence costs'!$D:$D,'Breakdown & Project Funding'!C$15)+SUMIFS('4. Personnel  costs'!$W:$W,'4. Personnel  costs'!$E:$E,'Breakdown & Project Funding'!$B64,'4. Personnel  costs'!$D:$D,'Breakdown & Project Funding'!C$15)+SUMIFS('5. Indirect Costs'!$J:$J,'5. Indirect Costs'!$E:$E,'Breakdown & Project Funding'!$B64,'5. Indirect Costs'!$D:$D,'Breakdown & Project Funding'!C$15)","v":0},{"$f":"SUMIFS('1. Costs linked to activities'!$K:$K,'1. Costs linked to activities'!$E:$E,$B64,'1. Costs linked to activities'!$D:$D,D$15)+SUMIFS('2. Communication Costs'!$K:$K,'2. Communication Costs'!$E:$E,'Breakdown & Project Funding'!$B64,'2. Communication Costs'!$D:$D,'Breakdown & Project Funding'!D$15)+SUMIFS('3. Travel & Subsistence costs'!$R:$R,'3. Travel & Subsistence costs'!$E:$E,'Breakdown & Project Funding'!$B64,'3. Travel & Subsistence costs'!$D:$D,'Breakdown & Project Funding'!D$15)+SUMIFS('4. Personnel  costs'!$W:$W,'4. Personnel  costs'!$E:$E,'Breakdown & Project Funding'!$B64,'4. Personnel  costs'!$D:$D,'Breakdown & Project Funding'!D$15)+SUMIFS('5. Indirect Costs'!$J:$J,'5. Indirect Costs'!$E:$E,'Breakdown & Project Funding'!$B64,'5. Indirect Costs'!$D:$D,'Breakdown & Project Funding'!D$15)","v":0},{"$f":"SUMIFS('1. Costs linked to activities'!$K:$K,'1. Costs linked to activities'!$E:$E,$B64,'1. Costs linked to activities'!$D:$D,E$15)+SUMIFS('2. Communication Costs'!$K:$K,'2. Communication Costs'!$E:$E,'Breakdown & Project Funding'!$B64,'2. Communication Costs'!$D:$D,'Breakdown & Project Funding'!E$15)+SUMIFS('3. Travel & Subsistence costs'!$R:$R,'3. Travel & Subsistence costs'!$E:$E,'Breakdown & Project Funding'!$B64,'3. Travel & Subsistence costs'!$D:$D,'Breakdown & Project Funding'!E$15)+SUMIFS('4. Personnel  costs'!$W:$W,'4. Personnel  costs'!$E:$E,'Breakdown & Project Funding'!$B64,'4. Personnel  costs'!$D:$D,'Breakdown & Project Funding'!E$15)+SUMIFS('5. Indirect Costs'!$J:$J,'5. Indirect Costs'!$E:$E,'Breakdown & Project Funding'!$B64,'5. Indirect Costs'!$D:$D,'Breakdown & Project Funding'!E$15)","v":0},{"$f":"SUMIFS('1. Costs linked to activities'!$K:$K,'1. Costs linked to activities'!$E:$E,$B64,'1. Costs linked to activities'!$D:$D,F$15)+SUMIFS('2. Communication Costs'!$K:$K,'2. Communication Costs'!$E:$E,'Breakdown & Project Funding'!$B64,'2. Communication Costs'!$D:$D,'Breakdown & Project Funding'!F$15)+SUMIFS('3. Travel & Subsistence costs'!$R:$R,'3. Travel & Subsistence costs'!$E:$E,'Breakdown & Project Funding'!$B64,'3. Travel & Subsistence costs'!$D:$D,'Breakdown & Project Funding'!F$15)+SUMIFS('4. Personnel  costs'!$W:$W,'4. Personnel  costs'!$E:$E,'Breakdown & Project Funding'!$B64,'4. Personnel  costs'!$D:$D,'Breakdown & Project Funding'!F$15)+SUMIFS('5. Indirect Costs'!$J:$J,'5. Indirect Costs'!$E:$E,'Breakdown & Project Funding'!$B64,'5. Indirect Costs'!$D:$D,'Breakdown & Project Funding'!F$15)","v":0},{"$f":"SUMIFS('1. Costs linked to activities'!$K:$K,'1. Costs linked to activities'!$E:$E,$B64,'1. Costs linked to activities'!$D:$D,G$15)+SUMIFS('2. Communication Costs'!$K:$K,'2. Communication Costs'!$E:$E,'Breakdown & Project Funding'!$B64,'2. Communication Costs'!$D:$D,'Breakdown & Project Funding'!G$15)+SUMIFS('3. Travel & Subsistence costs'!$R:$R,'3. Travel & Subsistence costs'!$E:$E,'Breakdown & Project Funding'!$B64,'3. Travel & Subsistence costs'!$D:$D,'Breakdown & Project Funding'!G$15)+SUMIFS('4. Personnel  costs'!$W:$W,'4. Personnel  costs'!$E:$E,'Breakdown & Project Funding'!$B64,'4. Personnel  costs'!$D:$D,'Breakdown & Project Funding'!G$15)+SUMIFS('5. Indirect Costs'!$J:$J,'5. Indirect Costs'!$E:$E,'Breakdown & Project Funding'!$B64,'5. Indirect Costs'!$D:$D,'Breakdown & Project Funding'!G$15)","v":0},0]
[null,"P50",{"$f":"SUMIFS('1. Costs linked to activities'!$K:$K,'1. Costs linked to activities'!$E:$E,$B65,'1. Costs linked to activities'!$D:$D,C$15)+SUMIFS('2. Communication Costs'!$K:$K,'2. Communication Costs'!$E:$E,'Breakdown & Project Funding'!$B65,'2. Communication Costs'!$D:$D,'Breakdown & Project Funding'!C$15)+SUMIFS('3. Travel & Subsistence costs'!$R:$R,'3. Travel & Subsistence costs'!$E:$E,'Breakdown & Project Funding'!$B65,'3. Travel & Subsistence costs'!$D:$D,'Breakdown & Project Funding'!C$15)+SUMIFS('4. Personnel  costs'!$W:$W,'4. Personnel  costs'!$E:$E,'Breakdown & Project Funding'!$B65,'4. Personnel  costs'!$D:$D,'Breakdown & Project Funding'!C$15)+SUMIFS('5. Indirect Costs'!$J:$J,'5. Indirect Costs'!$E:$E,'Breakdown & Project Funding'!$B65,'5. Indirect Costs'!$D:$D,'Breakdown & Project Funding'!C$15)","v":0},{"$f":"SUMIFS('1. Costs linked to activities'!$K:$K,'1. Costs linked to activities'!$E:$E,$B65,'1. Costs linked to activities'!$D:$D,D$15)+SUMIFS('2. Communication Costs'!$K:$K,'2. Communication Costs'!$E:$E,'Breakdown & Project Funding'!$B65,'2. Communication Costs'!$D:$D,'Breakdown & Project Funding'!D$15)+SUMIFS('3. Travel & Subsistence costs'!$R:$R,'3. Travel & Subsistence costs'!$E:$E,'Breakdown & Project Funding'!$B65,'3. Travel & Subsistence costs'!$D:$D,'Breakdown & Project Funding'!D$15)+SUMIFS('4. Personnel  costs'!$W:$W,'4. Personnel  costs'!$E:$E,'Breakdown & Project Funding'!$B65,'4. Personnel  costs'!$D:$D,'Breakdown & Project Funding'!D$15)+SUMIFS('5. Indirect Costs'!$J:$J,'5. Indirect Costs'!$E:$E,'Breakdown & Project Funding'!$B65,'5. Indirect Costs'!$D:$D,'Breakdown & Project Funding'!D$15)","v":0},{"$f":"SUMIFS('1. Costs linked to activities'!$K:$K,'1. Costs linked to activities'!$E:$E,$B65,'1. Costs linked to activities'!$D:$D,E$15)+SUMIFS('2. Communication Costs'!$K:$K,'2. Communication Costs'!$E:$E,'Breakdown & Project Funding'!$B65,'2. Communication Costs'!$D:$D,'Breakdown & Project Funding'!E$15)+SUMIFS('3. Travel & Subsistence costs'!$R:$R,'3. Travel & Subsistence costs'!$E:$E,'Breakdown & Project Funding'!$B65,'3. Travel & Subsistence costs'!$D:$D,'Breakdown & Project Funding'!E$15)+SUMIFS('4. Personnel  costs'!$W:$W,'4. Personnel  costs'!$E:$E,'Breakdown & Project Funding'!$B65,'4. Personnel  costs'!$D:$D,'Breakdown & Project Funding'!E$15)+SUMIFS('5. Indirect Costs'!$J:$J,'5. Indirect Costs'!$E:$E,'Breakdown & Project Funding'!$B65,'5. Indirect Costs'!$D:$D,'Breakdown & Project Funding'!E$15)","v":0},{"$f":"SUMIFS('1. Costs linked to activities'!$K:$K,'1. Costs linked to activities'!$E:$E,$B65,'1. Costs linked to activities'!$D:$D,F$15)+SUMIFS('2. Communication Costs'!$K:$K,'2. Communication Costs'!$E:$E,'Breakdown & Project Funding'!$B65,'2. Communication Costs'!$D:$D,'Breakdown & Project Funding'!F$15)+SUMIFS('3. Travel & Subsistence costs'!$R:$R,'3. Travel & Subsistence costs'!$E:$E,'Breakdown & Project Funding'!$B65,'3. Travel & Subsistence costs'!$D:$D,'Breakdown & Project Funding'!F$15)+SUMIFS('4. Personnel  costs'!$W:$W,'4. Personnel  costs'!$E:$E,'Breakdown & Project Funding'!$B65,'4. Personnel  costs'!$D:$D,'Breakdown & Project Funding'!F$15)+SUMIFS('5. Indirect Costs'!$J:$J,'5. Indirect Costs'!$E:$E,'Breakdown & Project Funding'!$B65,'5. Indirect Costs'!$D:$D,'Breakdown & Project Funding'!F$15)","v":0},{"$f":"SUMIFS('1. Costs linked to activities'!$K:$K,'1. Costs linked to activities'!$E:$E,$B65,'1. Costs linked to activities'!$D:$D,G$15)+SUMIFS('2. Communication Costs'!$K:$K,'2. Communication Costs'!$E:$E,'Breakdown & Project Funding'!$B65,'2. Communication Costs'!$D:$D,'Breakdown & Project Funding'!G$15)+SUMIFS('3. Travel & Subsistence costs'!$R:$R,'3. Travel & Subsistence costs'!$E:$E,'Breakdown & Project Funding'!$B65,'3. Travel & Subsistence costs'!$D:$D,'Breakdown & Project Funding'!G$15)+SUMIFS('4. Personnel  costs'!$W:$W,'4. Personnel  costs'!$E:$E,'Breakdown & Project Funding'!$B65,'4. Personnel  costs'!$D:$D,'Breakdown & Project Funding'!G$15)+SUMIFS('5. Indirect Costs'!$J:$J,'5. Indirect Costs'!$E:$E,'Breakdown & Project Funding'!$B65,'5. Indirect Costs'!$D:$D,'Breakdown & Project Funding'!G$15)","v":0},0]
[null,"P51",{"$f":"SUMIFS('1. Costs linked to activities'!$K:$K,'1. Costs linked to activities'!$E:$E,$B66,'1. Costs linked to activities'!$D:$D,C$15)+SUMIFS('2. Communication Costs'!$K:$K,'2. Communication Costs'!$E:$E,'Breakdown & Project Funding'!$B66,'2. Communication Costs'!$D:$D,'Breakdown & Project Funding'!C$15)+SUMIFS('3. Travel & Subsistence costs'!$R:$R,'3. Travel & Subsistence costs'!$E:$E,'Breakdown & Project Funding'!$B66,'3. Travel & Subsistence costs'!$D:$D,'Breakdown & Project Funding'!C$15)+SUMIFS('4. Personnel  costs'!$W:$W,'4. Personnel  costs'!$E:$E,'Breakdown & Project Funding'!$B66,'4. Personnel  costs'!$D:$D,'Breakdown & Project Funding'!C$15)+SUMIFS('5. Indirect Costs'!$J:$J,'5. Indirect Costs'!$E:$E,'Breakdown & Project Funding'!$B66,'5. Indirect Costs'!$D:$D,'Breakdown & Project Funding'!C$15)","v":0},{"$f":"SUMIFS('1. Costs linked to activities'!$K:$K,'1. Costs linked to activities'!$E:$E,$B66,'1. Costs linked to activities'!$D:$D,D$15)+SUMIFS('2. Communication Costs'!$K:$K,'2. Communication Costs'!$E:$E,'Breakdown & Project Funding'!$B66,'2. Communication Costs'!$D:$D,'Breakdown & Project Funding'!D$15)+SUMIFS('3. Travel & Subsistence costs'!$R:$R,'3. Travel & Subsistence costs'!$E:$E,'Breakdown & Project Funding'!$B66,'3. Travel & Subsistence costs'!$D:$D,'Breakdown & Project Funding'!D$15)+SUMIFS('4. Personnel  costs'!$W:$W,'4. Personnel  costs'!$E:$E,'Breakdown & Project Funding'!$B66,'4. Personnel  costs'!$D:$D,'Breakdown & Project Funding'!D$15)+SUMIFS('5. Indirect Costs'!$J:$J,'5. Indirect Costs'!$E:$E,'Breakdown & Project Funding'!$B66,'5. Indirect Costs'!$D:$D,'Breakdown & Project Funding'!D$15)","v":0},{"$f":"SUMIFS('1. Costs linked to activities'!$K:$K,'1. Costs linked to activities'!$E:$E,$B66,'1. Costs linked to activities'!$D:$D,E$15)+SUMIFS('2. Communication Costs'!$K:$K,'2. Communication Costs'!$E:$E,'Breakdown & Project Funding'!$B66,'2. Communication Costs'!$D:$D,'Breakdown & Project Funding'!E$15)+SUMIFS('3. Travel & Subsistence costs'!$R:$R,'3. Travel & Subsistence costs'!$E:$E,'Breakdown & Project Funding'!$B66,'3. Travel & Subsistence costs'!$D:$D,'Breakdown & Project Funding'!E$15)+SUMIFS('4. Personnel  costs'!$W:$W,'4. Personnel  costs'!$E:$E,'Breakdown & Project Funding'!$B66,'4. Personnel  costs'!$D:$D,'Breakdown & Project Funding'!E$15)+SUMIFS('5. Indirect Costs'!$J:$J,'5. Indirect Costs'!$E:$E,'Breakdown & Project Funding'!$B66,'5. Indirect Costs'!$D:$D,'Breakdown & Project Funding'!E$15)","v":0},{"$f":"SUMIFS('1. Costs linked to activities'!$K:$K,'1. Costs linked to activities'!$E:$E,$B66,'1. Costs linked to activities'!$D:$D,F$15)+SUMIFS('2. Communication Costs'!$K:$K,'2. Communication Costs'!$E:$E,'Breakdown & Project Funding'!$B66,'2. Communication Costs'!$D:$D,'Breakdown & Project Funding'!F$15)+SUMIFS('3. Travel & Subsistence costs'!$R:$R,'3. Travel & Subsistence costs'!$E:$E,'Breakdown & Project Funding'!$B66,'3. Travel & Subsistence costs'!$D:$D,'Breakdown & Project Funding'!F$15)+SUMIFS('4. Personnel  costs'!$W:$W,'4. Personnel  costs'!$E:$E,'Breakdown & Project Funding'!$B66,'4. Personnel  costs'!$D:$D,'Breakdown & Project Funding'!F$15)+SUMIFS('5. Indirect Costs'!$J:$J,'5. Indirect Costs'!$E:$E,'Breakdown & Project Funding'!$B66,'5. Indirect Costs'!$D:$D,'Breakdown & Project Funding'!F$15)","v":0},{"$f":"SUMIFS('1. Costs linked to activities'!$K:$K,'1. Costs linked to activities'!$E:$E,$B66,'1. Costs linked to activities'!$D:$D,G$15)+SUMIFS('2. Communication Costs'!$K:$K,'2. Communication Costs'!$E:$E,'Breakdown & Project Funding'!$B66,'2. Communication Costs'!$D:$D,'Breakdown & Project Funding'!G$15)+SUMIFS('3. Travel & Subsistence costs'!$R:$R,'3. Travel & Subsistence costs'!$E:$E,'Breakdown & Project Funding'!$B66,'3. Travel & Subsistence costs'!$D:$D,'Breakdown & Project Funding'!G$15)+SUMIFS('4. Personnel  costs'!$W:$W,'4. Personnel  costs'!$E:$E,'Breakdown & Project Funding'!$B66,'4. Personnel  costs'!$D:$D,'Breakdown & Project Funding'!G$15)+SUMIFS('5. Indirect Costs'!$J:$J,'5. Indirect Costs'!$E:$E,'Breakdown & Project Funding'!$B66,'5. Indirect Costs'!$D:$D,'Breakdown & Project Funding'!G$15)","v":0},0]
[null,"P52",{"$f":"SUMIFS('1. Costs linked to activities'!$K:$K,'1. Costs linked to activities'!$E:$E,$B67,'1. Costs linked to activities'!$D:$D,C$15)+SUMIFS('2. Communication Costs'!$K:$K,'2. Communication Costs'!$E:$E,'Breakdown & Project Funding'!$B67,'2. Communication Costs'!$D:$D,'Breakdown & Project Funding'!C$15)+SUMIFS('3. Travel & Subsistence costs'!$R:$R,'3. Travel & Subsistence costs'!$E:$E,'Breakdown & Project Funding'!$B67,'3. Travel & Subsistence costs'!$D:$D,'Breakdown & Project Funding'!C$15)+SUMIFS('4. Personnel  costs'!$W:$W,'4. Personnel  costs'!$E:$E,'Breakdown & Project Funding'!$B67,'4. Personnel  costs'!$D:$D,'Breakdown & Project Funding'!C$15)+SUMIFS('5. Indirect Costs'!$J:$J,'5. Indirect Costs'!$E:$E,'Breakdown & Project Funding'!$B67,'5. Indirect Costs'!$D:$D,'Breakdown & Project Funding'!C$15)","v":0},{"$f":"SUMIFS('1. Costs linked to activities'!$K:$K,'1. Costs linked to activities'!$E:$E,$B67,'1. Costs linked to activities'!$D:$D,D$15)+SUMIFS('2. Communication Costs'!$K:$K,'2. Communication Costs'!$E:$E,'Breakdown & Project Funding'!$B67,'2. Communication Costs'!$D:$D,'Breakdown & Project Funding'!D$15)+SUMIFS('3. Travel & Subsistence costs'!$R:$R,'3. Travel & Subsistence costs'!$E:$E,'Breakdown & Project Funding'!$B67,'3. Travel & Subsistence costs'!$D:$D,'Breakdown & Project Funding'!D$15)+SUMIFS('4. Personnel  costs'!$W:$W,'4. Personnel  costs'!$E:$E,'Breakdown & Project Funding'!$B67,'4. Personnel  costs'!$D:$D,'Breakdown & Project Funding'!D$15)+SUMIFS('5. Indirect Costs'!$J:$J,'5. Indirect Costs'!$E:$E,'Breakdown & Project Funding'!$B67,'5. Indirect Costs'!$D:$D,'Breakdown & Project Funding'!D$15)","v":0},{"$f":"SUMIFS('1. Costs linked to activities'!$K:$K,'1. Costs linked to activities'!$E:$E,$B67,'1. Costs linked to activities'!$D:$D,E$15)+SUMIFS('2. Communication Costs'!$K:$K,'2. Communication Costs'!$E:$E,'Breakdown & Project Funding'!$B67,'2. Communication Costs'!$D:$D,'Breakdown & Project Funding'!E$15)+SUMIFS('3. Travel & Subsistence costs'!$R:$R,'3. Travel & Subsistence costs'!$E:$E,'Breakdown & Project Funding'!$B67,'3. Travel & Subsistence costs'!$D:$D,'Breakdown & Project Funding'!E$15)+SUMIFS('4. Personnel  costs'!$W:$W,'4. Personnel  costs'!$E:$E,'Breakdown & Project Funding'!$B67,'4. Personnel  costs'!$D:$D,'Breakdown & Project Funding'!E$15)+SUMIFS('5. Indirect Costs'!$J:$J,'5. Indirect Costs'!$E:$E,'Breakdown & Project Funding'!$B67,'5. Indirect Costs'!$D:$D,'Breakdown & Project Funding'!E$15)","v":0},{"$f":"SUMIFS('1. Costs linked to activities'!$K:$K,'1. Costs linked to activities'!$E:$E,$B67,'1. Costs linked to activities'!$D:$D,F$15)+SUMIFS('2. Communication Costs'!$K:$K,'2. Communication Costs'!$E:$E,'Breakdown & Project Funding'!$B67,'2. Communication Costs'!$D:$D,'Breakdown & Project Funding'!F$15)+SUMIFS('3. Travel & Subsistence costs'!$R:$R,'3. Travel & Subsistence costs'!$E:$E,'Breakdown & Project Funding'!$B67,'3. Travel & Subsistence costs'!$D:$D,'Breakdown & Project Funding'!F$15)+SUMIFS('4. Personnel  costs'!$W:$W,'4. Personnel  costs'!$E:$E,'Breakdown & Project Funding'!$B67,'4. Personnel  costs'!$D:$D,'Breakdown & Project Funding'!F$15)+SUMIFS('5. Indirect Costs'!$J:$J,'5. Indirect Costs'!$E:$E,'Breakdown & Project Funding'!$B67,'5. Indirect Costs'!$D:$D,'Breakdown & Project Funding'!F$15)","v":0},{"$f":"SUMIFS('1. Costs linked to activities'!$K:$K,'1. Costs linked to activities'!$E:$E,$B67,'1. Costs linked to activities'!$D:$D,G$15)+SUMIFS('2. Communication Costs'!$K:$K,'2. Communication Costs'!$E:$E,'Breakdown & Project Funding'!$B67,'2. Communication Costs'!$D:$D,'Breakdown & Project Funding'!G$15)+SUMIFS('3. Travel & Subsistence costs'!$R:$R,'3. Travel & Subsistence costs'!$E:$E,'Breakdown & Project Funding'!$B67,'3. Travel & Subsistence costs'!$D:$D,'Breakdown & Project Funding'!G$15)+SUMIFS('4. Personnel  costs'!$W:$W,'4. Personnel  costs'!$E:$E,'Breakdown & Project Funding'!$B67,'4. Personnel  costs'!$D:$D,'Breakdown & Project Funding'!G$15)+SUMIFS('5. Indirect Costs'!$J:$J,'5. Indirect Costs'!$E:$E,'Breakdown & Project Funding'!$B67,'5. Indirect Costs'!$D:$D,'Breakdown & Project Funding'!G$15)","v":0},0]
[null,"P53",{"$f":"SUMIFS('1. Costs linked to activities'!$K:$K,'1. Costs linked to activities'!$E:$E,$B68,'1. Costs linked to activities'!$D:$D,C$15)+SUMIFS('2. Communication Costs'!$K:$K,'2. Communication Costs'!$E:$E,'Breakdown & Project Funding'!$B68,'2. Communication Costs'!$D:$D,'Breakdown & Project Funding'!C$15)+SUMIFS('3. Travel & Subsistence costs'!$R:$R,'3. Travel & Subsistence costs'!$E:$E,'Breakdown & Project Funding'!$B68,'3. Travel & Subsistence costs'!$D:$D,'Breakdown & Project Funding'!C$15)+SUMIFS('4. Personnel  costs'!$W:$W,'4. Personnel  costs'!$E:$E,'Breakdown & Project Funding'!$B68,'4. Personnel  costs'!$D:$D,'Breakdown & Project Funding'!C$15)+SUMIFS('5. Indirect Costs'!$J:$J,'5. Indirect Costs'!$E:$E,'Breakdown & Project Funding'!$B68,'5. Indirect Costs'!$D:$D,'Breakdown & Project Funding'!C$15)","v":0},{"$f":"SUMIFS('1. Costs linked to activities'!$K:$K,'1. Costs linked to activities'!$E:$E,$B68,'1. Costs linked to activities'!$D:$D,D$15)+SUMIFS('2. Communication Costs'!$K:$K,'2. Communication Costs'!$E:$E,'Breakdown & Project Funding'!$B68,'2. Communication Costs'!$D:$D,'Breakdown & Project Funding'!D$15)+SUMIFS('3. Travel & Subsistence costs'!$R:$R,'3. Travel & Subsistence costs'!$E:$E,'Breakdown & Project Funding'!$B68,'3. Travel & Subsistence costs'!$D:$D,'Breakdown & Project Funding'!D$15)+SUMIFS('4. Personnel  costs'!$W:$W,'4. Personnel  costs'!$E:$E,'Breakdown & Project Funding'!$B68,'4. Personnel  costs'!$D:$D,'Breakdown & Project Funding'!D$15)+SUMIFS('5. Indirect Costs'!$J:$J,'5. Indirect Costs'!$E:$E,'Breakdown & Project Funding'!$B68,'5. Indirect Costs'!$D:$D,'Breakdown & Project Funding'!D$15)","v":0},{"$f":"SUMIFS('1. Costs linked to activities'!$K:$K,'1. Costs linked to activities'!$E:$E,$B68,'1. Costs linked to activities'!$D:$D,E$15)+SUMIFS('2. Communication Costs'!$K:$K,'2. Communication Costs'!$E:$E,'Breakdown & Project Funding'!$B68,'2. Communication Costs'!$D:$D,'Breakdown & Project Funding'!E$15)+SUMIFS('3. Travel & Subsistence costs'!$R:$R,'3. Travel & Subsistence costs'!$E:$E,'Breakdown & Project Funding'!$B68,'3. Travel & Subsistence costs'!$D:$D,'Breakdown & Project Funding'!E$15)+SUMIFS('4. Personnel  costs'!$W:$W,'4. Personnel  costs'!$E:$E,'Breakdown & Project Funding'!$B68,'4. Personnel  costs'!$D:$D,'Breakdown & Project Funding'!E$15)+SUMIFS('5. Indirect Costs'!$J:$J,'5. Indirect Costs'!$E:$E,'Breakdown & Project Funding'!$B68,'5. Indirect Costs'!$D:$D,'Breakdown & Project Funding'!E$15)","v":0},{"$f":"SUMIFS('1. Costs linked to activities'!$K:$K,'1. Costs linked to activities'!$E:$E,$B68,'1. Costs linked to activities'!$D:$D,F$15)+SUMIFS('2. Communication Costs'!$K:$K,'2. Communication Costs'!$E:$E,'Breakdown & Project Funding'!$B68,'2. Communication Costs'!$D:$D,'Breakdown & Project Funding'!F$15)+SUMIFS('3. Travel & Subsistence costs'!$R:$R,'3. Travel & Subsistence costs'!$E:$E,'Breakdown & Project Funding'!$B68,'3. Travel & Subsistence costs'!$D:$D,'Breakdown & Project Funding'!F$15)+SUMIFS('4. Personnel  costs'!$W:$W,'4. Personnel  costs'!$E:$E,'Breakdown & Project Funding'!$B68,'4. Personnel  costs'!$D:$D,'Breakdown & Project Funding'!F$15)+SUMIFS('5. Indirect Costs'!$J:$J,'5. Indirect Costs'!$E:$E,'Breakdown & Project Funding'!$B68,'5. Indirect Costs'!$D:$D,'Breakdown & Project Funding'!F$15)","v":0},{"$f":"SUMIFS('1. Costs linked to activities'!$K:$K,'1. Costs linked to activities'!$E:$E,$B68,'1. Costs linked to activities'!$D:$D,G$15)+SUMIFS('2. Communication Costs'!$K:$K,'2. Communication Costs'!$E:$E,'Breakdown & Project Funding'!$B68,'2. Communication Costs'!$D:$D,'Breakdown & Project Funding'!G$15)+SUMIFS('3. Travel & Subsistence costs'!$R:$R,'3. Travel & Subsistence costs'!$E:$E,'Breakdown & Project Funding'!$B68,'3. Travel & Subsistence costs'!$D:$D,'Breakdown & Project Funding'!G$15)+SUMIFS('4. Personnel  costs'!$W:$W,'4. Personnel  costs'!$E:$E,'Breakdown & Project Funding'!$B68,'4. Personnel  costs'!$D:$D,'Breakdown & Project Funding'!G$15)+SUMIFS('5. Indirect Costs'!$J:$J,'5. Indirect Costs'!$E:$E,'Breakdown & Project Funding'!$B68,'5. Indirect Costs'!$D:$D,'Breakdown & Project Funding'!G$15)","v":0},0]
[null,"P54",{"$f":"SUMIFS('1. Costs linked to activities'!$K:$K,'1. Costs linked to activities'!$E:$E,$B69,'1. Costs linked to activities'!$D:$D,C$15)+SUMIFS('2. Communication Costs'!$K:$K,'2. Communication Costs'!$E:$E,'Breakdown & Project Funding'!$B69,'2. Communication Costs'!$D:$D,'Breakdown & Project Funding'!C$15)+SUMIFS('3. Travel & Subsistence costs'!$R:$R,'3. Travel & Subsistence costs'!$E:$E,'Breakdown & Project Funding'!$B69,'3. Travel & Subsistence costs'!$D:$D,'Breakdown & Project Funding'!C$15)+SUMIFS('4. Personnel  costs'!$W:$W,'4. Personnel  costs'!$E:$E,'Breakdown & Project Funding'!$B69,'4. Personnel  costs'!$D:$D,'Breakdown & Project Funding'!C$15)+SUMIFS('5. Indirect Costs'!$J:$J,'5. Indirect Costs'!$E:$E,'Breakdown & Project Funding'!$B69,'5. Indirect Costs'!$D:$D,'Breakdown & Project Funding'!C$15)","v":0},{"$f":"SUMIFS('1. Costs linked to activities'!$K:$K,'1. Costs linked to activities'!$E:$E,$B69,'1. Costs linked to activities'!$D:$D,D$15)+SUMIFS('2. Communication Costs'!$K:$K,'2. Communication Costs'!$E:$E,'Breakdown & Project Funding'!$B69,'2. Communication Costs'!$D:$D,'Breakdown & Project Funding'!D$15)+SUMIFS('3. Travel & Subsistence costs'!$R:$R,'3. Travel & Subsistence costs'!$E:$E,'Breakdown & Project Funding'!$B69,'3. Travel & Subsistence costs'!$D:$D,'Breakdown & Project Funding'!D$15)+SUMIFS('4. Personnel  costs'!$W:$W,'4. Personnel  costs'!$E:$E,'Breakdown & Project Funding'!$B69,'4. Personnel  costs'!$D:$D,'Breakdown & Project Funding'!D$15)+SUMIFS('5. Indirect Costs'!$J:$J,'5. Indirect Costs'!$E:$E,'Breakdown & Project Funding'!$B69,'5. Indirect Costs'!$D:$D,'Breakdown & Project Funding'!D$15)","v":0},{"$f":"SUMIFS('1. Costs linked to activities'!$K:$K,'1. Costs linked to activities'!$E:$E,$B69,'1. Costs linked to activities'!$D:$D,E$15)+SUMIFS('2. Communication Costs'!$K:$K,'2. Communication Costs'!$E:$E,'Breakdown & Project Funding'!$B69,'2. Communication Costs'!$D:$D,'Breakdown & Project Funding'!E$15)+SUMIFS('3. Travel & Subsistence costs'!$R:$R,'3. Travel & Subsistence costs'!$E:$E,'Breakdown & Project Funding'!$B69,'3. Travel & Subsistence costs'!$D:$D,'Breakdown & Project Funding'!E$15)+SUMIFS('4. Personnel  costs'!$W:$W,'4. Personnel  costs'!$E:$E,'Breakdown & Project Funding'!$B69,'4. Personnel  costs'!$D:$D,'Breakdown & Project Funding'!E$15)+SUMIFS('5. Indirect Costs'!$J:$J,'5. Indirect Costs'!$E:$E,'Breakdown & Project Funding'!$B69,'5. Indirect Costs'!$D:$D,'Breakdown & Project Funding'!E$15)","v":0},{"$f":"SUMIFS('1. Costs linked to activities'!$K:$K,'1. Costs linked to activities'!$E:$E,$B69,'1. Costs linked to activities'!$D:$D,F$15)+SUMIFS('2. Communication Costs'!$K:$K,'2. Communication Costs'!$E:$E,'Breakdown & Project Funding'!$B69,'2. Communication Costs'!$D:$D,'Breakdown & Project Funding'!F$15)+SUMIFS('3. Travel & Subsistence costs'!$R:$R,'3. Travel & Subsistence costs'!$E:$E,'Breakdown & Project Funding'!$B69,'3. Travel & Subsistence costs'!$D:$D,'Breakdown & Project Funding'!F$15)+SUMIFS('4. Personnel  costs'!$W:$W,'4. Personnel  costs'!$E:$E,'Breakdown & Project Funding'!$B69,'4. Personnel  costs'!$D:$D,'Breakdown & Project Funding'!F$15)+SUMIFS('5. Indirect Costs'!$J:$J,'5. Indirect Costs'!$E:$E,'Breakdown & Project Funding'!$B69,'5. Indirect Costs'!$D:$D,'Breakdown & Project Funding'!F$15)","v":0},{"$f":"SUMIFS('1. Costs linked to activities'!$K:$K,'1. Costs linked to activities'!$E:$E,$B69,'1. Costs linked to activities'!$D:$D,G$15)+SUMIFS('2. Communication Costs'!$K:$K,'2. Communication Costs'!$E:$E,'Breakdown & Project Funding'!$B69,'2. Communication Costs'!$D:$D,'Breakdown & Project Funding'!G$15)+SUMIFS('3. Travel & Subsistence costs'!$R:$R,'3. Travel & Subsistence costs'!$E:$E,'Breakdown & Project Funding'!$B69,'3. Travel & Subsistence costs'!$D:$D,'Breakdown & Project Funding'!G$15)+SUMIFS('4. Personnel  costs'!$W:$W,'4. Personnel  costs'!$E:$E,'Breakdown & Project Funding'!$B69,'4. Personnel  costs'!$D:$D,'Breakdown & Project Funding'!G$15)+SUMIFS('5. Indirect Costs'!$J:$J,'5. Indirect Costs'!$E:$E,'Breakdown & Project Funding'!$B69,'5. Indirect Costs'!$D:$D,'Breakdown & Project Funding'!G$15)","v":0},0]
[null,"P55",{"$f":"SUMIFS('1. Costs linked to activities'!$K:$K,'1. Costs linked to activities'!$E:$E,$B70,'1. Costs linked to activities'!$D:$D,C$15)+SUMIFS('2. Communication Costs'!$K:$K,'2. Communication Costs'!$E:$E,'Breakdown & Project Funding'!$B70,'2. Communication Costs'!$D:$D,'Breakdown & Project Funding'!C$15)+SUMIFS('3. Travel & Subsistence costs'!$R:$R,'3. Travel & Subsistence costs'!$E:$E,'Breakdown & Project Funding'!$B70,'3. Travel & Subsistence costs'!$D:$D,'Breakdown & Project Funding'!C$15)+SUMIFS('4. Personnel  costs'!$W:$W,'4. Personnel  costs'!$E:$E,'Breakdown & Project Funding'!$B70,'4. Personnel  costs'!$D:$D,'Breakdown & Project Funding'!C$15)+SUMIFS('5. Indirect Costs'!$J:$J,'5. Indirect Costs'!$E:$E,'Breakdown & Project Funding'!$B70,'5. Indirect Costs'!$D:$D,'Breakdown & Project Funding'!C$15)","v":0},{"$f":"SUMIFS('1. Costs linked to activities'!$K:$K,'1. Costs linked to activities'!$E:$E,$B70,'1. Costs linked to activities'!$D:$D,D$15)+SUMIFS('2. Communication Costs'!$K:$K,'2. Communication Costs'!$E:$E,'Breakdown & Project Funding'!$B70,'2. Communication Costs'!$D:$D,'Breakdown & Project Funding'!D$15)+SUMIFS('3. Travel & Subsistence costs'!$R:$R,'3. Travel & Subsistence costs'!$E:$E,'Breakdown & Project Funding'!$B70,'3. Travel & Subsistence costs'!$D:$D,'Breakdown & Project Funding'!D$15)+SUMIFS('4. Personnel  costs'!$W:$W,'4. Personnel  costs'!$E:$E,'Breakdown & Project Funding'!$B70,'4. Personnel  costs'!$D:$D,'Breakdown & Project Funding'!D$15)+SUMIFS('5. Indirect Costs'!$J:$J,'5. Indirect Costs'!$E:$E,'Breakdown & Project Funding'!$B70,'5. Indirect Costs'!$D:$D,'Breakdown & Project Funding'!D$15)","v":0},{"$f":"SUMIFS('1. Costs linked to activities'!$K:$K,'1. Costs linked to activities'!$E:$E,$B70,'1. Costs linked to activities'!$D:$D,E$15)+SUMIFS('2. Communication Costs'!$K:$K,'2. Communication Costs'!$E:$E,'Breakdown & Project Funding'!$B70,'2. Communication Costs'!$D:$D,'Breakdown & Project Funding'!E$15)+SUMIFS('3. Travel & Subsistence costs'!$R:$R,'3. Travel & Subsistence costs'!$E:$E,'Breakdown & Project Funding'!$B70,'3. Travel & Subsistence costs'!$D:$D,'Breakdown & Project Funding'!E$15)+SUMIFS('4. Personnel  costs'!$W:$W,'4. Personnel  costs'!$E:$E,'Breakdown & Project Funding'!$B70,'4. Personnel  costs'!$D:$D,'Breakdown & Project Funding'!E$15)+SUMIFS('5. Indirect Costs'!$J:$J,'5. Indirect Costs'!$E:$E,'Breakdown & Project Funding'!$B70,'5. Indirect Costs'!$D:$D,'Breakdown & Project Funding'!E$15)","v":0},{"$f":"SUMIFS('1. Costs linked to activities'!$K:$K,'1. Costs linked to activities'!$E:$E,$B70,'1. Costs linked to activities'!$D:$D,F$15)+SUMIFS('2. Communication Costs'!$K:$K,'2. Communication Costs'!$E:$E,'Breakdown & Project Funding'!$B70,'2. Communication Costs'!$D:$D,'Breakdown & Project Funding'!F$15)+SUMIFS('3. Travel & Subsistence costs'!$R:$R,'3. Travel & Subsistence costs'!$E:$E,'Breakdown & Project Funding'!$B70,'3. Travel & Subsistence costs'!$D:$D,'Breakdown & Project Funding'!F$15)+SUMIFS('4. Personnel  costs'!$W:$W,'4. Personnel  costs'!$E:$E,'Breakdown & Project Funding'!$B70,'4. Personnel  costs'!$D:$D,'Breakdown & Project Funding'!F$15)+SUMIFS('5. Indirect Costs'!$J:$J,'5. Indirect Costs'!$E:$E,'Breakdown & Project Funding'!$B70,'5. Indirect Costs'!$D:$D,'Breakdown & Project Funding'!F$15)","v":0},{"$f":"SUMIFS('1. Costs linked to activities'!$K:$K,'1. Costs linked to activities'!$E:$E,$B70,'1. Costs linked to activities'!$D:$D,G$15)+SUMIFS('2. Communication Costs'!$K:$K,'2. Communication Costs'!$E:$E,'Breakdown & Project Funding'!$B70,'2. Communication Costs'!$D:$D,'Breakdown & Project Funding'!G$15)+SUMIFS('3. Travel & Subsistence costs'!$R:$R,'3. Travel & Subsistence costs'!$E:$E,'Breakdown & Project Funding'!$B70,'3. Travel & Subsistence costs'!$D:$D,'Breakdown & Project Funding'!G$15)+SUMIFS('4. Personnel  costs'!$W:$W,'4. Personnel  costs'!$E:$E,'Breakdown & Project Funding'!$B70,'4. Personnel  costs'!$D:$D,'Breakdown & Project Funding'!G$15)+SUMIFS('5. Indirect Costs'!$J:$J,'5. Indirect Costs'!$E:$E,'Breakdown & Project Funding'!$B70,'5. Indirect Costs'!$D:$D,'Breakdown & Project Funding'!G$15)","v":0},0]
[]
[]
[null,"Budget Breakdown by Activity / Budget Chapters"]
[]
[null,"TOTAL",null,{"$f":"SUM(D77:D276)","v":0},{"$f":"SUM(E77:E276)","v":0},0,0,{"$f":"+Overview!E24","v":0},{"$f":"SUM(D75:H75)","v":0}]
[null,"Activity name","Activity N°","1. Costs linked to activities","2. Communication \nCosts","3. Travel & Subsistence\nCosts","4. Personnel \nCosts","5. Indirect costs","Total costs of the activity\n(EUR)"]
[null,{"$f":"IF('Action  Plan'!C20=\"\",\"\",'Action  Plan'!C20)","v":""},"A1",{"$f":"SUMIF('1. Costs linked to activities'!B:B,C77,'1. Costs linked to activities'!K:K)","v":0},{"$f":"SUMIF('2. Communication Costs'!B:B,C77,'2. Communication Costs'!K:K)","v":0},{"$f":"SUMIF('3. Travel & Subsistence costs'!B:B,'Breakdown & Project Funding'!C77,'3. Travel & Subsistence costs'!R:R)","v":0},{"$f":"SUMIF('4. Personnel  costs'!B:B,'Breakdown & Project Funding'!C77,'4. Personnel  costs'!W:W)","v":0},null,{"$f":"SUM(D77:H77)","v":0}]
[null,{"$f":"IF('Action  Plan'!C21=\"\",\"\",'Action  Plan'!C21)","v":""},"A2",{"$f":"SUMIF('1. Costs linked to activities'!B:B,C78,'1. Costs linked to activities'!K:K)","v":0},{"$f":"SUMIF('2. Communication Costs'!B:B,C78,'2. Communication Costs'!K:K)","v":0},{"$f":"SUMIF('3. Travel & Subsistence costs'!B:B,'Breakdown & Project Funding'!C78,'3. Travel & Subsistence costs'!R:R)","v":0},{"$f":"SUMIF('4. Personnel  costs'!B:B,'Breakdown & Project Funding'!C78,'4. Personnel  costs'!W:W)","v":0},null,{"$f":"SUM(D78:H78)","v":0}]
[null,{"$f":"IF('Action  Plan'!C22=\"\",\"\",'Action  Plan'!C22)","v":""},"A3",{"$f":"SUMIF('1. Costs linked to activities'!B:B,C79,'1. Costs linked to activities'!K:K)","v":0},{"$f":"SUMIF('2. Communication Costs'!B:B,C79,'2. Communication Costs'!K:K)","v":0},{"$f":"SUMIF('3. Travel & Subsistence costs'!B:B,'Breakdown & Project Funding'!C79,'3. Travel & Subsistence costs'!R:R)","v":0},{"$f":"SUMIF('4. Personnel  costs'!B:B,'Breakdown & Project Funding'!C79,'4. Personnel  costs'!W:W)","v":0},null,0]
[null,{"$f":"IF('Action  Plan'!C23=\"\",\"\",'Action  Plan'!C23)","v":""},"A4",{"$f":"SUMIF('1. Costs linked to activities'!B:B,C80,'1. Costs linked to activities'!K:K)","v":0},{"$f":"SUMIF('2. Communication Costs'!B:B,C80,'2. Communication Costs'!K:K)","v":0},{"$f":"SUMIF('3. Travel & Subsistence costs'!B:B,'Breakdown & Project Funding'!C80,'3. Travel & Subsistence costs'!R:R)","v":0},{"$f":"SUMIF('4. Personnel  costs'!B:B,'Breakdown & Project Funding'!C80,'4. Personnel  costs'!W:W)","v":0},null,0]
[null,{"$f":"IF('Action  Plan'!C24=\"\",\"\",'Action  Plan'!C24)","v":""},"A5",{"$f":"SUMIF('1. Costs linked to activities'!B:B,C81,'1. Costs linked to activities'!K:K)","v":0},{"$f":"SUMIF('2. Communication Costs'!B:B,C81,'2. Communication Costs'!K:K)","v":0},{"$f":"SUMIF('3. Travel & Subsistence costs'!B:B,'Breakdown & Project Funding'!C81,'3. Travel & Subsistence costs'!R:R)","v":0},{"$f":"SUMIF('4. Personnel  costs'!B:B,'Breakdown & Project Funding'!C81,'4. Personnel  costs'!W:W)","v":0},null,0]
[null,{"$f":"IF('Action  Plan'!C25=\"\",\"\",'Action  Plan'!C25)","v":""},"A6",{"$f":"SUMIF('1. Costs linked to activities'!B:B,C82,'1. Costs linked to activities'!K:K)","v":0},{"$f":"SUMIF('2. Communication Costs'!B:B,C82,'2. Communication Costs'!K:K)","v":0},{"$f":"SUMIF('3. Travel & Subsistence costs'!B:B,'Breakdown & Project Funding'!C82,'3. Travel & Subsistence costs'!R:R)","v":0},{"$f":"SUMIF('4. Personnel  costs'!B:B,'Breakdown & Project Funding'!C82,'4. Personnel  costs'!W:W)","v":0},null,0]
[null,{"$f":"IF('Action  Plan'!C26=\"\",\"\",'Action  Plan'!C26)","v":""},"A7",{"$f":"SUMIF('1. Costs linked to activities'!B:B,C83,'1. Costs linked to activities'!K:K)","v":0},{"$f":"SUMIF('2. Communication Costs'!B:B,C83,'2. Communication Costs'!K:K)","v":0},{"$f":"SUMIF('3. Travel & Subsistence costs'!B:B,'Breakdown & Project Funding'!C83,'3. Travel & Subsistence costs'!R:R)","v":0},{"$f":"SUMIF('4. Personnel  costs'!B:B,'Breakdown & Project Funding'!C83,'4. Personnel  costs'!W:W)","v":0},null,0]
[null,{"$f":"IF('Action  Plan'!C27=\"\",\"\",'Action  Plan'!C27)","v":""},"A8",{"$f":"SUMIF('1. Costs linked to activities'!B:B,C84,'1. Costs linked to activities'!K:K)","v":0},{"$f":"SUMIF('2. Communication Costs'!B:B,C84,'2. Communication Costs'!K:K)","v":0},{"$f":"SUMIF('3. Travel & Subsistence costs'!B:B,'Breakdown & Project Funding'!C84,'3. Travel & Subsistence costs'!R:R)","v":0},{"$f":"SUMIF('4. Personnel  costs'!B:B,'Breakdown & Project Funding'!C84,'4. Personnel  costs'!W:W)","v":0},null,0]
[null,{"$f":"IF('Action  Plan'!C28=\"\",\"\",'Action  Plan'!C28)","v":""},"A9",{"$f":"SUMIF('1. Costs linked to activities'!B:B,C85,'1. Costs linked to activities'!K:K)","v":0},{"$f":"SUMIF('2. Communication Costs'!B:B,C85,'2. Communication Costs'!K:K)","v":0},{"$f":"SUMIF('3. Travel & Subsistence costs'!B:B,'Breakdown & Project Funding'!C85,'3. Travel & Subsistence costs'!R:R)","v":0},{"$f":"SUMIF('4. Personnel  costs'!B:B,'Breakdown & Project Funding'!C85,'4. Personnel  costs'!W:W)","v":0},null,0]
[null,{"$f":"IF('Action  Plan'!C29=\"\",\"\",'Action  Plan'!C29)","v":""},"A10",{"$f":"SUMIF('1. Costs linked to activities'!B:B,C86,'1. Costs linked to activities'!K:K)","v":0},{"$f":"SUMIF('2. Communication Costs'!B:B,C86,'2. Communication Costs'!K:K)","v":0},{"$f":"SUMIF('3. Travel & Subsistence costs'!B:B,'Breakdown & Project Funding'!C86,'3. Travel & Subsistence costs'!R:R)","v":0},{"$f":"SUMIF('4. Personnel  costs'!B:B,'Breakdown & Project Funding'!C86,'4. Personnel  costs'!W:W)","v":0},null,0]
[null,{"$f":"IF('Action  Plan'!C30=\"\",\"\",'Action  Plan'!C30)","v":""},"A11",{"$f":"SUMIF('1. Costs linked to activities'!B:B,C87,'1. Costs linked to activities'!K:K)","v":0},{"$f":"SUMIF('2. Communication Costs'!B:B,C87,'2. Communication Costs'!K:K)","v":0},{"$f":"SUMIF('3. Travel & Subsistence costs'!B:B,'Breakdown & Project Funding'!C87,'3. Travel & Subsistence costs'!R:R)","v":0},{"$f":"SUMIF('4. Personnel  costs'!B:B,'Breakdown & Project Funding'!C87,'4. Personnel  costs'!W:W)","v":0},null,0]
[null,{"$f":"IF('Action  Plan'!C31=\"\",\"\",'Action  Plan'!C31)","v":""},"A12",{"$f":"SUMIF('1. Costs linked to activities'!B:B,C88,'1. Costs linked to activities'!K:K)","v":0},{"$f":"SUMIF('2. Communication Costs'!B:B,C88,'2. Communication Costs'!K:K)","v":0},{"$f":"SUMIF('3. Travel & Subsistence costs'!B:B,'Breakdown & Project Funding'!C88,'3. Travel & Subsistence costs'!R:R)","v":0},{"$f":"SUMIF('4. Personnel  costs'!B:B,'Breakdown & Project Funding'!C88,'4. Personnel  costs'!W:W)","v":0},null,0]
[null,{"$f":"IF('Action  Plan'!C32=\"\",\"\",'Action  Plan'!C32)","v":""},"A13",{"$f":"SUMIF('1. Costs linked to activities'!B:B,C89,'1. Costs linked to activities'!K:K)","v":0},{"$f":"SUMIF('2. Communication Costs'!B:B,C89,'2. Communication Costs'!K:K)","v":0},{"$f":"SUMIF('3. Travel & Subsistence costs'!B:B,'Breakdown & Project Funding'!C89,'3. Travel & Subsistence costs'!R:R)","v":0},{"$f":"SUMIF('4. Personnel  costs'!B:B,'Breakdown & Project Funding'!C89,'4. Personnel  costs'!W:W)","v":0},null,0]
[null,{"$f":"IF('Action  Plan'!C33=\"\",\"\",'Action  Plan'!C33)","v":""},"A14",{"$f":"SUMIF('1. Costs linked to activities'!B:B,C90,'1. Costs linked to activities'!K:K)","v":0},{"$f":"SUMIF('2. Communication Costs'!B:B,C90,'2. Communication Costs'!K:K)","v":0},{"$f":"SUMIF('3. Travel & Subsistence costs'!B:B,'Breakdown & Project Funding'!C90,'3. Travel & Subsistence costs'!R:R)","v":0},{"$f":"SUMIF('4. Personnel  costs'!B:B,'Breakdown & Project Funding'!C90,'4. Personnel  costs'!W:W)","v":0},null,0]
[null,{"$f":"IF('Action  Plan'!C34=\"\",\"\",'Action  Plan'!C34)","v":""},"A15",{"$f":"SUMIF('1. Costs linked to activities'!B:B,C91,'1. Costs linked to activities'!K:K)","v":0},{"$f":"SUMIF('2. Communication Costs'!B:B,C91,'2. Communication Costs'!K:K)","v":0},{"$f":"SUMIF('3. Travel & Subsistence costs'!B:B,'Breakdown & Project Funding'!C91,'3. Travel & Subsistence costs'!R:R)","v":0},{"$f":"SUMIF('4. Personnel  costs'!B:B,'Breakdown & Project Funding'!C91,'4. Personnel  costs'!W:W)","v":0},null,0]
[null,{"$f":"IF('Action  Plan'!C35=\"\",\"\",'Action  Plan'!C35)","v":""},"A16",{"$f":"SUMIF('1. Costs linked to activities'!B:B,C92,'1. Costs linked to activities'!K:K)","v":0},{"$f":"SUMIF('2. Communication Costs'!B:B,C92,'2. Communication Costs'!K:K)","v":0},{"$f":"SUMIF('3. Travel & Subsistence costs'!B:B,'Breakdown & Project Funding'!C92,'3. Travel & Subsistence costs'!R:R)","v":0},{"$f":"SUMIF('4. Personnel  costs'!B:B,'Breakdown & Project Funding'!C92,'4. Personnel  costs'!W:W)","v":0},null,0]
[null,{"$f":"IF('Action  Plan'!C36=\"\",\"\",'Action  Plan'!C36)","v":""},"A17",{"$f":"SUMIF('1. Costs linked to activities'!B:B,C93,'1. Costs linked to activities'!K:K)","v":0},{"$f":"SUMIF('2. Communication Costs'!B:B,C93,'2. Communication Costs'!K:K)","v":0},{"$f":"SUMIF('3. Travel & Subsistence costs'!B:B,'Breakdown & Project Funding'!C93,'3. Travel & Subsistence costs'!R:R)","v":0},{"$f":"SUMIF('4. Personnel  costs'!B:B,'Breakdown & Project Funding'!C93,'4. Personnel  costs'!W:W)","v":0},null,0]
[null,{"$f":"IF('Action  Plan'!C37=\"\",\"\",'Action  Plan'!C37)","v":""},"A18",{"$f":"SUMIF('1. Costs linked to activities'!B:B,C94,'1. Costs linked to activities'!K:K)","v":0},{"$f":"SUMIF('2. Communication Costs'!B:B,C94,'2. Communication Costs'!K:K)","v":0},{"$f":"SUMIF('3. Travel & Subsistence costs'!B:B,'Breakdown & Project Funding'!C94,'3. Travel & Subsistence costs'!R:R)","v":0},{"$f":"SUMIF('4. Personnel  costs'!B:B,'Breakdown & Project Funding'!C94,'4. Personnel  costs'!W:W)","v":0},null,0]
[null,{"$f":"IF('Action  Plan'!C38=\"\",\"\",'Action  Plan'!C38)","v":""},"A19",{"$f":"SUMIF('1. Costs linked to activities'!B:B,C95,'1. Costs linked to activities'!K:K)","v":0},{"$f":"SUMIF('2. Communication Costs'!B:B,C95,'2. Communication Costs'!K:K)","v":0},{"$f":"SUMIF('3. Travel & Subsistence costs'!B:B,'Breakdown & Project Funding'!C95,'3. Travel & Subsistence costs'!R:R)","v":0},{"$f":"SUMIF('4. Personnel  costs'!B:B,'Breakdown & Project Funding'!C95,'4. Personnel  costs'!W:W)","v":0},null,0]
[null,{"$f":"IF('Action  Plan'!C39=\"\",\"\",'Action  Plan'!C39)","v":""},"A20",{"$f":"SUMIF('1. Costs linked to activities'!B:B,C96,'1. Costs linked to activities'!K:K)","v":0},{"$f":"SUMIF('2. Communication Costs'!B:B,C96,'2. Communication Costs'!K:K)","v":0},{"$f":"SUMIF('3. Travel & Subsistence costs'!B:B,'Breakdown & Project Funding'!C96,'3. Travel & Subsistence costs'!R:R)","v":0},{"$f":"SUMIF('4. Personnel  costs'!B:B,'Breakdown & Project Funding'!C96,'4. Personnel  costs'!W:W)","v":0},null,0]
[null,{"$f":"IF('Action  Plan'!C40=\"\",\"\",'Action  Plan'!C40)","v":""},"A21",{"$f":"SUMIF('1. Costs linked to activities'!B:B,C97,'1. Costs linked to activities'!K:K)","v":0},{"$f":"SUMIF('2. Communication Costs'!B:B,C97,'2. Communication Costs'!K:K)","v":0},{"$f":"SUMIF('3. Travel & Subsistence costs'!B:B,'Breakdown & Project Funding'!C97,'3. Travel & Subsistence costs'!R:R)","v":0},{"$f":"SUMIF('4. Personnel  costs'!B:B,'Breakdown & Project Funding'!C97,'4. Personnel  costs'!W:W)","v":0},null,0]
[null,{"$f":"IF('Action  Plan'!C41=\"\",\"\",'Action  Plan'!C41)","v":""},"A22",{"$f":"SUMIF('1. Costs linked to activities'!B:B,C98,'1. Costs linked to activities'!K:K)","v":0},{"$f":"SUMIF('2. Communication Costs'!B:B,C98,'2. Communication Costs'!K:K)","v":0},{"$f":"SUMIF('3. Travel & Subsistence costs'!B:B,'Breakdown & Project Funding'!C98,'3. Travel & Subsistence costs'!R:R)","v":0},{"$f":"SUMIF('4. Personnel  costs'!B:B,'Breakdown & Project Funding'!C98,'4. Personnel  costs'!W:W)","v":0},null,0]
[null,{"$f":"IF('Action  Plan'!C42=\"\",\"\",'Action  Plan'!C42)","v":""},"A23",{"$f":"SUMIF('1. Costs linked to activities'!B:B,C99,'1. Costs linked to activities'!K:K)","v":0},{"$f":"SUMIF('2. Communication Costs'!B:B,C99,'2. Communication Costs'!K:K)","v":0},{"$f":"SUMIF('3. Travel & Subsistence costs'!B:B,'Breakdown & Project Funding'!C99,'3. Travel & Subsistence costs'!R:R)","v":0},{"$f":"SUMIF('4. Personnel  costs'!B:B,'Breakdown & Project Funding'!C99,'4. Personnel  costs'!W:W)","v":0},null,0]
[null,{"$f":"IF('Action  Plan'!C43=\"\",\"\",'Action  Plan'!C43)","v":""},"A24",{"$f":"SUMIF('1. Costs linked to activities'!B:B,C100,'1. Costs linked to activities'!K:K)","v":0},{"$f":"SUMIF('2. Communication Costs'!B:B,C100,'2. Communication Costs'!K:K)","v":0},{"$f":"SUMIF('3. Travel & Subsistence costs'!B:B,'Breakdown & Project Funding'!C100,'3. Travel & Subsistence costs'!R:R)","v":0},{"$f":"SUMIF('4. Personnel  costs'!B:B,'Breakdown & Project Funding'!C100,'4. Personnel  costs'!W:W)","v":0},null,0]
[null,{"$f":"IF('Action  Plan'!C44=\"\",\"\",'Action  Plan'!C44)","v":""},"A25",{"$f":"SUMIF('1. Costs linked to activities'!B:B,C101,'1. Costs linked to activities'!K:K)","v":0},{"$f":"SUMIF('2. Communication Costs'!B:B,C101,'2. Communication Costs'!K:K)","v":0},{"$f":"SUMIF('3. Travel & Subsistence costs'!B:B,'Breakdown & Project Funding'!C101,'3. Travel & Subsistence costs'!R:R)","v":0},{"$f":"SUMIF('4. Personnel  costs'!B:B,'Breakdown & Project Funding'!C101,'4. Personnel  costs'!W:W)","v":0},null,0]
[null,{"$f":"IF('Action  Plan'!C45=\"\",\"\",'Action  Plan'!C45)","v":""},"A26",{"$f":"SUMIF('1. Costs linked to activities'!B:B,C102,'1. Costs linked to activities'!K:K)","v":0},{"$f":"SUMIF('2. Communication Costs'!B:B,C102,'2. Communication Costs'!K:K)","v":0},{"$f":"SUMIF('3. Travel & Subsistence costs'!B:B,'Breakdown & Project Funding'!C102,'3. Travel & Subsistence costs'!R:R)","v":0},{"$f":"SUMIF('4. Personnel  costs'!B:B,'Breakdown & Project Funding'!C102,'4. Personnel  costs'!W:W)","v":0},null,0]
[null,{"$f":"IF('Action  Plan'!C46=\"\",\"\",'Action  Plan'!C46)","v":""},"A27",{"$f":"SUMIF('1. Costs linked to activities'!B:B,C103,'1. Costs linked to activities'!K:K)","v":0},{"$f":"SUMIF('2. Communication Costs'!B:B,C103,'2. Communication Costs'!K:K)","v":0},{"$f":"SUMIF('3. Travel & Subsistence costs'!B:B,'Breakdown & Project Funding'!C103,'3. Travel & Subsistence costs'!R:R)","v":0},{"$f":"SUMIF('4. Personnel  costs'!B:B,'Breakdown & Project Funding'!C103,'4. Personnel  costs'!W:W)","v":0},null,0]
[null,{"$f":"IF('Action  Plan'!C47=\"\",\"\",'Action  Plan'!C47)","v":""},"A28",{"$f":"SUMIF('1. Costs linked to activities'!B:B,C104,'1. Costs linked to activities'!K:K)","v":0},{"$f":"SUMIF('2. Communication Costs'!B:B,C104,'2. Communication Costs'!K:K)","v":0},{"$f":"SUMIF('3. Travel & Subsistence costs'!B:B,'Breakdown & Project Funding'!C104,'3. Travel & Subsistence costs'!R:R)","v":0},{"$f":"SUMIF('4. Personnel  costs'!B:B,'Breakdown & Project Funding'!C104,'4. Personnel  costs'!W:W)","v":0},null,0]
[null,{"$f":"IF('Action  Plan'!C48=\"\",\"\",'Action  Plan'!C48)","v":""},"A29",{"$f":"SUMIF('1. Costs linked to activities'!B:B,C105,'1. Costs linked to activities'!K:K)","v":0},{"$f":"SUMIF('2. Communication Costs'!B:B,C105,'2. Communication Costs'!K:K)","v":0},{"$f":"SUMIF('3. Travel & Subsistence costs'!B:B,'Breakdown & Project Funding'!C105,'3. Travel & Subsistence costs'!R:R)","v":0},{"$f":"SUMIF('4. Personnel  costs'!B:B,'Breakdown & Project Funding'!C105,'4. Personnel  costs'!W:W)","v":0},null,0]
[null,{"$f":"IF('Action  Plan'!C49=\"\",\"\",'Action  Plan'!C49)","v":""},"A30",{"$f":"SUMIF('1. Costs linked to activities'!B:B,C106,'1. Costs linked to activities'!K:K)","v":0},{"$f":"SUMIF('2. Communication Costs'!B:B,C106,'2. Communication Costs'!K:K)","v":0},{"$f":"SUMIF('3. Travel & Subsistence costs'!B:B,'Breakdown & Project Funding'!C106,'3. Travel & Subsistence costs'!R:R)","v":0},{"$f":"SUMIF('4. Personnel  costs'!B:B,'Breakdown & Project Funding'!C106,'4. Personnel  costs'!W:W)","v":0},null,0]
[null,{"$f":"IF('Action  Plan'!C50=\"\",\"\",'Action  Plan'!C50)","v":""},"A31",{"$f":"SUMIF('1. Costs linked to activities'!B:B,C107,'1. Costs linked to activities'!K:K)","v":0},{"$f":"SUMIF('2. Communication Costs'!B:B,C107,'2. Communication Costs'!K:K)","v":0},{"$f":"SUMIF('3. Travel & Subsistence costs'!B:B,'Breakdown & Project Funding'!C107,'3. Travel & Subsistence costs'!R:R)","v":0},{"$f":"SUMIF('4. Personnel  costs'!B:B,'Breakdown & Project Funding'!C107,'4. Personnel  costs'!W:W)","v":0},null,0]
[null,{"$f":"IF('Action  Plan'!C51=\"\",\"\",'Action  Plan'!C51)","v":""},"A32",{"$f":"SUMIF('1. Costs linked to activities'!B:B,C108,'1. Costs linked to activities'!K:K)","v":0},{"$f":"SUMIF('2. Communication Costs'!B:B,C108,'2. Communication Costs'!K:K)","v":0},{"$f":"SUMIF('3. Travel & Subsistence costs'!B:B,'Breakdown & Project Funding'!C108,'3. Travel & Subsistence costs'!R:R)","v":0},{"$f":"SUMIF('4. Personnel  costs'!B:B,'Breakdown & Project Funding'!C108,'4. Personnel  costs'!W:W)","v":0},null,0]
[null,{"$f":"IF('Action  Plan'!C52=\"\",\"\",'Action  Plan'!C52)","v":""},"A33",{"$f":"SUMIF('1. Costs linked to activities'!B:B,C109,'1. Costs linked to activities'!K:K)","v":0},{"$f":"SUMIF('2. Communication Costs'!B:B,C109,'2. Communication Costs'!K:K)","v":0},{"$f":"SUMIF('3. Travel & Subsistence costs'!B:B,'Breakdown & Project Funding'!C109,'3. Travel & Subsistence costs'!R:R)","v":0},{"$f":"SUMIF('4. Personnel  costs'!B:B,'Breakdown & Project Funding'!C109,'4. Personnel  costs'!W:W)","v":0},null,0]
[null,{"$f":"IF('Action  Plan'!C53=\"\",\"\",'Action  Plan'!C53)","v":""},"A34",{"$f":"SUMIF('1. Costs linked to activities'!B:B,C110,'1. Costs linked to activities'!K:K)","v":0},{"$f":"SUMIF('2. Communication Costs'!B:B,C110,'2. Communication Costs'!K:K)","v":0},{"$f":"SUMIF('3. Travel & Subsistence costs'!B:B,'Breakdown & Project Funding'!C110,'3. Travel & Subsistence costs'!R:R)","v":0},{"$f":"SUMIF('4. Personnel  costs'!B:B,'Breakdown & Project Funding'!C110,'4. Personnel  costs'!W:W)","v":0},null,0]
[null,{"$f":"IF('Action  Plan'!C54=\"\",\"\",'Action  Plan'!C54)","v":""},"A35",{"$f":"SUMIF('1. Costs linked to activities'!B:B,C111,'1. Costs linked to activities'!K:K)","v":0},{"$f":"SUMIF('2. Communication Costs'!B:B,C111,'2. Communication Costs'!K:K)","v":0},{"$f":"SUMIF('3. Travel & Subsistence costs'!B:B,'Breakdown & Project Funding'!C111,'3. Travel & Subsistence costs'!R:R)","v":0},{"$f":"SUMIF('4. Personnel  costs'!B:B,'Breakdown & Project Funding'!C111,'4. Personnel  costs'!W:W)","v":0},null,0]
[null,{"$f":"IF('Action  Plan'!C55=\"\",\"\",'Action  Plan'!C55)","v":""},"A36",{"$f":"SUMIF('1. Costs linked to activities'!B:B,C112,'1. Costs linked to activities'!K:K)","v":0},{"$f":"SUMIF('2. Communication Costs'!B:B,C112,'2. Communication Costs'!K:K)","v":0},{"$f":"SUMIF('3. Travel & Subsistence costs'!B:B,'Breakdown & Project Funding'!C112,'3. Travel & Subsistence costs'!R:R)","v":0},{"$f":"SUMIF('4. Personnel  costs'!B:B,'Breakdown & Project Funding'!C112,'4. Personnel  costs'!W:W)","v":0},null,0]
[null,{"$f":"IF('Action  Plan'!C56=\"\",\"\",'Action  Plan'!C56)","v":""},"A37",{"$f":"SUMIF('1. Costs linked to activities'!B:B,C113,'1. Costs linked to activities'!K:K)","v":0},{"$f":"SUMIF('2. Communication Costs'!B:B,C113,'2. Communication Costs'!K:K)","v":0},{"$f":"SUMIF('3. Travel & Subsistence costs'!B:B,'Breakdown & Project Funding'!C113,'3. Travel & Subsistence costs'!R:R)","v":0},{"$f":"SUMIF('4. Personnel  costs'!B:B,'Breakdown & Project Funding'!C113,'4. Personnel  costs'!W:W)","v":0},null,0]
[null,{"$f":"IF('Action  Plan'!C57=\"\",\"\",'Action  Plan'!C57)","v":""},"A38",{"$f":"SUMIF('1. Costs linked to activities'!B:B,C114,'1. Costs linked to activities'!K:K)","v":0},{"$f":"SUMIF('2. Communication Costs'!B:B,C114,'2. Communication Costs'!K:K)","v":0},{"$f":"SUMIF('3. Travel & Subsistence costs'!B:B,'Breakdown & Project Funding'!C114,'3. Travel & Subsistence costs'!R:R)","v":0},{"$f":"SUMIF('4. Personnel  costs'!B:B,'Breakdown & Project Funding'!C114,'4. Personnel  costs'!W:W)","v":0},null,0]
[null,{"$f":"IF('Action  Plan'!C58=\"\",\"\",'Action  Plan'!C58)","v":""},"A39",{"$f":"SUMIF('1. Costs linked to activities'!B:B,C115,'1. Costs linked to activities'!K:K)","v":0},{"$f":"SUMIF('2. Communication Costs'!B:B,C115,'2. Communication Costs'!K:K)","v":0},{"$f":"SUMIF('3. Travel & Subsistence costs'!B:B,'Breakdown & Project Funding'!C115,'3. Travel & Subsistence costs'!R:R)","v":0},{"$f":"SUMIF('4. Personnel  costs'!B:B,'Breakdown & Project Funding'!C115,'4. Personnel  costs'!W:W)","v":0},null,0]
[null,{"$f":"IF('Action  Plan'!C59=\"\",\"\",'Action  Plan'!C59)","v":""},"A40",{"$f":"SUMIF('1. Costs linked to activities'!B:B,C116,'1. Costs linked to activities'!K:K)","v":0},{"$f":"SUMIF('2. Communication Costs'!B:B,C116,'2. Communication Costs'!K:K)","v":0},{"$f":"SUMIF('3. Travel & Subsistence costs'!B:B,'Breakdown & Project Funding'!C116,'3. Travel & Subsistence costs'!R:R)","v":0},{"$f":"SUMIF('4. Personnel  costs'!B:B,'Breakdown & Project Funding'!C116,'4. Personnel  costs'!W:W)","v":0},null,0]
[null,{"$f":"IF('Action  Plan'!C60=\"\",\"\",'Action  Plan'!C60)","v":""},"A41",{"$f":"SUMIF('1. Costs linked to activities'!B:B,C117,'1. Costs linked to activities'!K:K)","v":0},{"$f":"SUMIF('2. Communication Costs'!B:B,C117,'2. Communication Costs'!K:K)","v":0},{"$f":"SUMIF('3. Travel & Subsistence costs'!B:B,'Breakdown & Project Funding'!C117,'3. Travel & Subsistence costs'!R:R)","v":0},{"$f":"SUMIF('4. Personnel  costs'!B:B,'Breakdown & Project Funding'!C117,'4. Personnel  costs'!W:W)","v":0},null,0]
[null,{"$f":"IF('Action  Plan'!C61=\"\",\"\",'Action  Plan'!C61)","v":""},"A42",{"$f":"SUMIF('1. Costs linked to activities'!B:B,C118,'1. Costs linked to activities'!K:K)","v":0},{"$f":"SUMIF('2. Communication Costs'!B:B,C118,'2. Communication Costs'!K:K)","v":0},{"$f":"SUMIF('3. Travel & Subsistence costs'!B:B,'Breakdown & Project Funding'!C118,'3. Travel & Subsistence costs'!R:R)","v":0},{"$f":"SUMIF('4. Personnel  costs'!B:B,'Breakdown & Project Funding'!C118,'4. Personnel  costs'!W:W)","v":0},null,0]
[null,{"$f":"IF('Action  Plan'!C62=\"\",\"\",'Action  Plan'!C62)","v":""},"A43",{"$f":"SUMIF('1. Costs linked to activities'!B:B,C119,'1. Costs linked to activities'!K:K)","v":0},{"$f":"SUMIF('2. Communication Costs'!B:B,C119,'2. Communication Costs'!K:K)","v":0},{"$f":"SUMIF('3. Travel & Subsistence costs'!B:B,'Breakdown & Project Funding'!C119,'3. Travel & Subsistence costs'!R:R)","v":0},{"$f":"SUMIF('4. Personnel  costs'!B:B,'Breakdown & Project Funding'!C119,'4. Personnel  costs'!W:W)","v":0},null,0]
[null,{"$f":"IF('Action  Plan'!C63=\"\",\"\",'Action  Plan'!C63)","v":""},"A44",{"$f":"SUMIF('1. Costs linked to activities'!B:B,C120,'1. Costs linked to activities'!K:K)","v":0},{"$f":"SUMIF('2. Communication Costs'!B:B,C120,'2. Communication Costs'!K:K)","v":0},{"$f":"SUMIF('3. Travel & Subsistence costs'!B:B,'Breakdown & Project Funding'!C120,'3. Travel & Subsistence costs'!R:R)","v":0},{"$f":"SUMIF('4. Personnel  costs'!B:B,'Breakdown & Project Funding'!C120,'4. Personnel  costs'!W:W)","v":0},null,0]
[null,{"$f":"IF('Action  Plan'!C64=\"\",\"\",'Action  Plan'!C64)","v":""},"A45",{"$f":"SUMIF('1. Costs linked to activities'!B:B,C121,'1. Costs linked to activities'!K:K)","v":0},{"$f":"SUMIF('2. Communication Costs'!B:B,C121,'2. Communication Costs'!K:K)","v":0},{"$f":"SUMIF('3. Travel & Subsistence costs'!B:B,'Breakdown & Project Funding'!C121,'3. Travel & Subsistence costs'!R:R)","v":0},{"$f":"SUMIF('4. Personnel  costs'!B:B,'Breakdown & Project Funding'!C121,'4. Personnel  costs'!W:W)","v":0},null,0]
[null,{"$f":"IF('Action  Plan'!C65=\"\",\"\",'Action  Plan'!C65)","v":""},"A46",{"$f":"SUMIF('1. Costs linked to activities'!B:B,C122,'1. Costs linked to activities'!K:K)","v":0},{"$f":"SUMIF('2. Communication Costs'!B:B,C122,'2. Communication Costs'!K:K)","v":0},{"$f":"SUMIF('3. Travel & Subsistence costs'!B:B,'Breakdown & Project Funding'!C122,'3. Travel & Subsistence costs'!R:R)","v":0},{"$f":"SUMIF('4. Personnel  costs'!B:B,'Breakdown & Project Funding'!C122,'4. Personnel  costs'!W:W)","v":0},null,0]
[null,{"$f":"IF('Action  Plan'!C66=\"\",\"\",'Action  Plan'!C66)","v":""},"A47",{"$f":"SUMIF('1. Costs linked to activities'!B:B,C123,'1. Costs linked to activities'!K:K)","v":0},{"$f":"SUMIF('2. Communication Costs'!B:B,C123,'2. Communication Costs'!K:K)","v":0},{"$f":"SUMIF('3. Travel & Subsistence costs'!B:B,'Breakdown & Project Funding'!C123,'3. Travel & Subsistence costs'!R:R)","v":0},{"$f":"SUMIF('4. Personnel  costs'!B:B,'Breakdown & Project Funding'!C123,'4. Personnel  costs'!W:W)","v":0},null,0]
[null,{"$f":"IF('Action  Plan'!C67=\"\",\"\",'Action  Plan'!C67)","v":""},"A48",{"$f":"SUMIF('1. Costs linked to activities'!B:B,C124,'1. Costs linked to activities'!K:K)","v":0},{"$f":"SUMIF('2. Communication Costs'!B:B,C124,'2. Communication Costs'!K:K)","v":0},{"$f":"SUMIF('3. Travel & Subsistence costs'!B:B,'Breakdown & Project Funding'!C124,'3. Travel & Subsistence costs'!R:R)","v":0},{"$f":"SUMIF('4. Personnel  costs'!B:B,'Breakdown & Project Funding'!C124,'4. Personnel  costs'!W:W)","v":0},null,0]
[null,{"$f":"IF('Action  Plan'!C68=\"\",\"\",'Action  Plan'!C68)","v":""},"A49",{"$f":"SUMIF('1. Costs linked to activities'!B:B,C125,'1. Costs linked to activities'!K:K)","v":0},{"$f":"SUMIF('2. Communication Costs'!B:B,C125,'2. Communication Costs'!K:K)","v":0},{"$f":"SUMIF('3. Travel & Subsistence costs'!B:B,'Breakdown & Project Funding'!C125,'3. Travel & Subsistence costs'!R:R)","v":0},{"$f":"SUMIF('4. Personnel  costs'!B:B,'Breakdown & Project Funding'!C125,'4. Personnel  costs'!W:W)","v":0},null,0]
[null,{"$f":"IF('Action  Plan'!C69=\"\",\"\",'Action  Plan'!C69)","v":""},"A50",{"$f":"SUMIF('1. Costs linked to activities'!B:B,C126,'1. Costs linked to activities'!K:K)","v":0},{"$f":"SUMIF('2. Communication Costs'!B:B,C126,'2. Communication Costs'!K:K)","v":0},{"$f":"SUMIF('3. Travel & Subsistence costs'!B:B,'Breakdown & Project Funding'!C126,'3. Travel & Subsistence costs'!R:R)","v":0},{"$f":"SUMIF('4. Personnel  costs'!B:B,'Breakdown & Project Funding'!C126,'4. Personnel  costs'!W:W)","v":0},null,0]
[null,{"$f":"IF('Action  Plan'!C70=\"\",\"\",'Action  Plan'!C70)","v":""},"A51",{"$f":"SUMIF('1. Costs linked to activities'!B:B,C127,'1. Costs linked to activities'!K:K)","v":0},{"$f":"SUMIF('2. Communication Costs'!B:B,C127,'2. Communication Costs'!K:K)","v":0},{"$f":"SUMIF('3. Travel & Subsistence costs'!B:B,'Breakdown & Project Funding'!C127,'3. Travel & Subsistence costs'!R:R)","v":0},{"$f":"SUMIF('4. Personnel  costs'!B:B,'Breakdown & Project Funding'!C127,'4. Personnel  costs'!W:W)","v":0},null,0]
[null,{"$f":"IF('Action  Plan'!C71=\"\",\"\",'Action  Plan'!C71)","v":""},"A52",{"$f":"SUMIF('1. Costs linked to activities'!B:B,C128,'1. Costs linked to activities'!K:K)","v":0},{"$f":"SUMIF('2. Communication Costs'!B:B,C128,'2. Communication Costs'!K:K)","v":0},{"$f":"SUMIF('3. Travel & Subsistence costs'!B:B,'Breakdown & Project Funding'!C128,'3. Travel & Subsistence costs'!R:R)","v":0},{"$f":"SUMIF('4. Personnel  costs'!B:B,'Breakdown & Project Funding'!C128,'4. Personnel  costs'!W:W)","v":0},null,0]
[null,{"$f":"IF('Action  Plan'!C72=\"\",\"\",'Action  Plan'!C72)","v":""},"A53",{"$f":"SUMIF('1. Costs linked to activities'!B:B,C129,'1. Costs linked to activities'!K:K)","v":0},{"$f":"SUMIF('2. Communication Costs'!B:B,C129,'2. Communication Costs'!K:K)","v":0},{"$f":"SUMIF('3. Travel & Subsistence costs'!B:B,'Breakdown & Project Funding'!C129,'3. Travel & Subsistence costs'!R:R)","v":0},{"$f":"SUMIF('4. Personnel  costs'!B:B,'Breakdown & Project Funding'!C129,'4. Personnel  costs'!W:W)","v":0},null,0]
[null,{"$f":"IF('Action  Plan'!C73=\"\",\"\",'Action  Plan'!C73)","v":""},"A54",{"$f":"SUMIF('1. Costs linked to activities'!B:B,C130,'1. Costs linked to activities'!K:K)","v":0},{"$f":"SUMIF('2. Communication Costs'!B:B,C130,'2. Communication Costs'!K:K)","v":0},{"$f":"SUMIF('3. Travel & Subsistence costs'!B:B,'Breakdown & Project Funding'!C130,'3. Travel & Subsistence costs'!R:R)","v":0},{"$f":"SUMIF('4. Personnel  costs'!B:B,'Breakdown & Project Funding'!C130,'4. Personnel  costs'!W:W)","v":0},null,0]
[null,{"$f":"IF('Action  Plan'!C74=\"\",\"\",'Action  Plan'!C74)","v":""},"A55",{"$f":"SUMIF('1. Costs linked to activities'!B:B,C131,'1. Costs linked to activities'!K:K)","v":0},{"$f":"SUMIF('2. Communication Costs'!B:B,C131,'2. Communication Costs'!K:K)","v":0},{"$f":"SUMIF('3. Travel & Subsistence costs'!B:B,'Breakdown & Project Funding'!C131,'3. Travel & Subsistence costs'!R:R)","v":0},{"$f":"SUMIF('4. Personnel  costs'!B:B,'Breakdown & Project Funding'!C131,'4. Personnel  costs'!W:W)","v":0},null,0]
[null,{"$f":"IF('Action  Plan'!C75=\"\",\"\",'Action  Plan'!C75)","v":""},"A56",{"$f":"SUMIF('1. Costs linked to activities'!B:B,C132,'1. Costs linked to activities'!K:K)","v":0},{"$f":"SUMIF('2. Communication Costs'!B:B,C132,'2. Communication Costs'!K:K)","v":0},{"$f":"SUMIF('3. Travel & Subsistence costs'!B:B,'Breakdown & Project Funding'!C132,'3. Travel & Subsistence costs'!R:R)","v":0},{"$f":"SUMIF('4. Personnel  costs'!B:B,'Breakdown & Project Funding'!C132,'4. Personnel  costs'!W:W)","v":0},null,0]
[null,{"$f":"IF('Action  Plan'!C76=\"\",\"\",'Action  Plan'!C76)","v":""},"A57",{"$f":"SUMIF('1. Costs linked to activities'!B:B,C133,'1. Costs linked to activities'!K:K)","v":0},{"$f":"SUMIF('2. Communication Costs'!B:B,C133,'2. Communication Costs'!K:K)","v":0},{"$f":"SUMIF('3. Travel & Subsistence costs'!B:B,'Breakdown & Project Funding'!C133,'3. Travel & Subsistence costs'!R:R)","v":0},{"$f":"SUMIF('4. Personnel  costs'!B:B,'Breakdown & Project Funding'!C133,'4. Personnel  costs'!W:W)","v":0},null,0]
[null,{"$f":"IF('Action  Plan'!C77=\"\",\"\",'Action  Plan'!C77)","v":""},"A58",{"$f":"SUMIF('1. Costs linked to activities'!B:B,C134,'1. Costs linked to activities'!K:K)","v":0},{"$f":"SUMIF('2. Communication Costs'!B:B,C134,'2. Communication Costs'!K:K)","v":0},{"$f":"SUMIF('3. Travel & Subsistence costs'!B:B,'Breakdown & Project Funding'!C134,'3. Travel & Subsistence costs'!R:R)","v":0},{"$f":"SUMIF('4. Personnel  costs'!B:B,'Breakdown & Project Funding'!C134,'4. Personnel  costs'!W:W)","v":0},null,0]
[null,{"$f":"IF('Action  Plan'!C78=\"\",\"\",'Action  Plan'!C78)","v":""},"A59",{"$f":"SUMIF('1. Costs linked to activities'!B:B,C135,'1. Costs linked to activities'!K:K)","v":0},{"$f":"SUMIF('2. Communication Costs'!B:B,C135,'2. Communication Costs'!K:K)","v":0},{"$f":"SUMIF('3. Travel & Subsistence costs'!B:B,'Breakdown & Project Funding'!C135,'3. Travel & Subsistence costs'!R:R)","v":0},{"$f":"SUMIF('4. Personnel  costs'!B:B,'Breakdown & Project Funding'!C135,'4. Personnel  costs'!W:W)","v":0},null,0]
[null,{"$f":"IF('Action  Plan'!C79=\"\",\"\",'Action  Plan'!C79)","v":""},"A60",{"$f":"SUMIF('1. Costs linked to activities'!B:B,C136,'1. Costs linked to activities'!K:K)","v":0},{"$f":"SUMIF('2. Communication Costs'!B:B,C136,'2. Communication Costs'!K:K)","v":0},{"$f":"SUMIF('3. Travel & Subsistence costs'!B:B,'Breakdown & Project Funding'!C136,'3. Travel & Subsistence costs'!R:R)","v":0},{"$f":"SUMIF('4. Personnel  costs'!B:B,'Breakdown & Project Funding'!C136,'4. Personnel  costs'!W:W)","v":0},null,0]
[null,{"$f":"IF('Action  Plan'!C80=\"\",\"\",'Action  Plan'!C80)","v":""},"A61",{"$f":"SUMIF('1. Costs linked to activities'!B:B,C137,'1. Costs linked to activities'!K:K)","v":0},{"$f":"SUMIF('2. Communication Costs'!B:B,C137,'2. Communication Costs'!K:K)","v":0},{"$f":"SUMIF('3. Travel & Subsistence costs'!B:B,'Breakdown & Project Funding'!C137,'3. Travel & Subsistence costs'!R:R)","v":0},{"$f":"SUMIF('4. Personnel  costs'!B:B,'Breakdown & Project Funding'!C137,'4. Personnel  costs'!W:W)","v":0},null,0]
[null,{"$f":"IF('Action  Plan'!C81=\"\",\"\",'Action  Plan'!C81)","v":""},"A62",{"$f":"SUMIF('1. Costs linked to activities'!B:B,C138,'1. Costs linked to activities'!K:K)","v":0},{"$f":"SUMIF('2. Communication Costs'!B:B,C138,'2. Communication Costs'!K:K)","v":0},{"$f":"SUMIF('3. Travel & Subsistence costs'!B:B,'Breakdown & Project Funding'!C138,'3. Travel & Subsistence costs'!R:R)","v":0},{"$f":"SUMIF('4. Personnel  costs'!B:B,'Breakdown & Project Funding'!C138,'4. Personnel  costs'!W:W)","v":0},null,0]
[null,{"$f":"IF('Action  Plan'!C82=\"\",\"\",'Action  Plan'!C82)","v":""},"A63",{"$f":"SUMIF('1. Costs linked to activities'!B:B,C139,'1. Costs linked to activities'!K:K)","v":0},{"$f":"SUMIF('2. Communication Costs'!B:B,C139,'2. Communication Costs'!K:K)","v":0},{"$f":"SUMIF('3. Travel & Subsistence costs'!B:B,'Breakdown & Project Funding'!C139,'3. Travel & Subsistence costs'!R:R)","v":0},{"$f":"SUMIF('4. Personnel  costs'!B:B,'Breakdown & Project Funding'!C139,'4. Personnel  costs'!W:W)","v":0},null,0]
[null,{"$f":"IF('Action  Plan'!C83=\"\",\"\",'Action  Plan'!C83)","v":""},"A64",{"$f":"SUMIF('1. Costs linked to activities'!B:B,C140,'1. Costs linked to activities'!K:K)","v":0},{"$f":"SUMIF('2. Communication Costs'!B:B,C140,'2. Communication Costs'!K:K)","v":0},{"$f":"SUMIF('3. Travel & Subsistence costs'!B:B,'Breakdown & Project Funding'!C140,'3. Travel & Subsistence costs'!R:R)","v":0},{"$f":"SUMIF('4. Personnel  costs'!B:B,'Breakdown & Project Funding'!C140,'4. Personnel  costs'!W:W)","v":0},null,0]
[null,{"$f":"IF('Action  Plan'!C84=\"\",\"\",'Action  Plan'!C84)","v":""},"A65",{"$f":"SUMIF('1. Costs linked to activities'!B:B,C141,'1. Costs linked to activities'!K:K)","v":0},{"$f":"SUMIF('2. Communication Costs'!B:B,C141,'2. Communication Costs'!K:K)","v":0},{"$f":"SUMIF('3. Travel & Subsistence costs'!B:B,'Breakdown & Project Funding'!C141,'3. Travel & Subsistence costs'!R:R)","v":0},{"$f":"SUMIF('4. Personnel  costs'!B:B,'Breakdown & Project Funding'!C141,'4. Personnel  costs'!W:W)","v":0},null,0]
[null,{"$f":"IF('Action  Plan'!C85=\"\",\"\",'Action  Plan'!C85)","v":""},"A66",{"$f":"SUMIF('1. Costs linked to activities'!B:B,C142,'1. Costs linked to activities'!K:K)","v":0},{"$f":"SUMIF('2. Communication Costs'!B:B,C142,'2. Communication Costs'!K:K)","v":0},{"$f":"SUMIF('3. Travel & Subsistence costs'!B:B,'Breakdown & Project Funding'!C142,'3. Travel & Subsistence costs'!R:R)","v":0},{"$f":"SUMIF('4. Personnel  costs'!B:B,'Breakdown & Project Funding'!C142,'4. Personnel  costs'!W:W)","v":0},null,{"$f":"SUM(D142:H142)","v":0}]
[null,{"$f":"IF('Action  Plan'!C86=\"\",\"\",'Action  Plan'!C86)","v":""},"A67",{"$f":"SUMIF('1. Costs linked to activities'!B:B,C143,'1. Costs linked to activities'!K:K)","v":0},{"$f":"SUMIF('2. Communication Costs'!B:B,C143,'2. Communication Costs'!K:K)","v":0},{"$f":"SUMIF('3. Travel & Subsistence costs'!B:B,'Breakdown & Project Funding'!C143,'3. Travel & Subsistence costs'!R:R)","v":0},{"$f":"SUMIF('4. Personnel  costs'!B:B,'Breakdown & Project Funding'!C143,'4. Personnel  costs'!W:W)","v":0},null,0]
[null,{"$f":"IF('Action  Plan'!C87=\"\",\"\",'Action  Plan'!C87)","v":""},"A68",{"$f":"SUMIF('1. Costs linked to activities'!B:B,C144,'1. Costs linked to activities'!K:K)","v":0},{"$f":"SUMIF('2. Communication Costs'!B:B,C144,'2. Communication Costs'!K:K)","v":0},{"$f":"SUMIF('3. Travel & Subsistence costs'!B:B,'Breakdown & Project Funding'!C144,'3. Travel & Subsistence costs'!R:R)","v":0},{"$f":"SUMIF('4. Personnel  costs'!B:B,'Breakdown & Project Funding'!C144,'4. Personnel  costs'!W:W)","v":0},null,0]
[null,{"$f":"IF('Action  Plan'!C88=\"\",\"\",'Action  Plan'!C88)","v":""},"A69",{"$f":"SUMIF('1. Costs linked to activities'!B:B,C145,'1. Costs linked to activities'!K:K)","v":0},{"$f":"SUMIF('2. Communication Costs'!B:B,C145,'2. Communication Costs'!K:K)","v":0},{"$f":"SUMIF('3. Travel & Subsistence costs'!B:B,'Breakdown & Project Funding'!C145,'3. Travel & Subsistence costs'!R:R)","v":0},{"$f":"SUMIF('4. Personnel  costs'!B:B,'Breakdown & Project Funding'!C145,'4. Personnel  costs'!W:W)","v":0},null,0]
[null,{"$f":"IF('Action  Plan'!C89=\"\",\"\",'Action  Plan'!C89)","v":""},"A70",{"$f":"SUMIF('1. Costs linked to activities'!B:B,C146,'1. Costs linked to activities'!K:K)","v":0},{"$f":"SUMIF('2. Communication Costs'!B:B,C146,'2. Communication Costs'!K:K)","v":0},{"$f":"SUMIF('3. Travel & Subsistence costs'!B:B,'Breakdown & Project Funding'!C146,'3. Travel & Subsistence costs'!R:R)","v":0},{"$f":"SUMIF('4. Personnel  costs'!B:B,'Breakdown & Project Funding'!C146,'4. Personnel  costs'!W:W)","v":0},null,0]
[null,{"$f":"IF('Action  Plan'!C90=\"\",\"\",'Action  Plan'!C90)","v":""},"A71",{"$f":"SUMIF('1. Costs linked to activities'!B:B,C147,'1. Costs linked to activities'!K:K)","v":0},{"$f":"SUMIF('2. Communication Costs'!B:B,C147,'2. Communication Costs'!K:K)","v":0},{"$f":"SUMIF('3. Travel & Subsistence costs'!B:B,'Breakdown & Project Funding'!C147,'3. Travel & Subsistence costs'!R:R)","v":0},{"$f":"SUMIF('4. Personnel  costs'!B:B,'Breakdown & Project Funding'!C147,'4. Personnel  costs'!W:W)","v":0},null,0]
[null,{"$f":"IF('Action  Plan'!C91=\"\",\"\",'Action  Plan'!C91)","v":""},"A72",{"$f":"SUMIF('1. Costs linked to activities'!B:B,C148,'1. Costs linked to activities'!K:K)","v":0},{"$f":"SUMIF('2. Communication Costs'!B:B,C148,'2. Communication Costs'!K:K)","v":0},{"$f":"SUMIF('3. Travel & Subsistence costs'!B:B,'Breakdown & Project Funding'!C148,'3. Travel & Subsistence costs'!R:R)","v":0},{"$f":"SUMIF('4. Personnel  costs'!B:B,'Breakdown & Project Funding'!C148,'4. Personnel  costs'!W:W)","v":0},null,0]
[null,{"$f":"IF('Action  Plan'!C92=\"\",\"\",'Action  Plan'!C92)","v":""},"A73",{"$f":"SUMIF('1. Costs linked to activities'!B:B,C149,'1. Costs linked to activities'!K:K)","v":0},{"$f":"SUMIF('2. Communication Costs'!B:B,C149,'2. Communication Costs'!K:K)","v":0},{"$f":"SUMIF('3. Travel & Subsistence costs'!B:B,'Breakdown & Project Funding'!C149,'3. Travel & Subsistence costs'!R:R)","v":0},{"$f":"SUMIF('4. Personnel  costs'!B:B,'Breakdown & Project Funding'!C149,'4. Personnel  costs'!W:W)","v":0},null,0]
[null,{"$f":"IF('Action  Plan'!C93=\"\",\"\",'Action  Plan'!C93)","v":""},"A74",{"$f":"SUMIF('1. Costs linked to activities'!B:B,C150,'1. Costs linked to activities'!K:K)","v":0},{"$f":"SUMIF('2. Communication Costs'!B:B,C150,'2. Communication Costs'!K:K)","v":0},{"$f":"SUMIF('3. Travel & Subsistence costs'!B:B,'Breakdown & Project Funding'!C150,'3. Travel & Subsistence costs'!R:R)","v":0},{"$f":"SUMIF('4. Personnel  costs'!B:B,'Breakdown & Project Funding'!C150,'4. Personnel  costs'!W:W)","v":0},null,0]
[null,{"$f":"IF('Action  Plan'!C94=\"\",\"\",'Action  Plan'!C94)","v":""},"A75",{"$f":"SUMIF('1. Costs linked to activities'!B:B,C151,'1. Costs linked to activities'!K:K)","v":0},{"$f":"SUMIF('2. Communication Costs'!B:B,C151,'2. Communication Costs'!K:K)","v":0},{"$f":"SUMIF('3. Travel & Subsistence costs'!B:B,'Breakdown & Project Funding'!C151,'3. Travel & Subsistence costs'!R:R)","v":0},{"$f":"SUMIF('4. Personnel  costs'!B:B,'Breakdown & Project Funding'!C151,'4. Personnel  costs'!W:W)","v":0},null,0]
[null,{"$f":"IF('Action  Plan'!C95=\"\",\"\",'Action  Plan'!C95)","v":""},"A76",{"$f":"SUMIF('1. Costs linked to activities'!B:B,C152,'1. Costs linked to activities'!K:K)","v":0},{"$f":"SUMIF('2. Communication Costs'!B:B,C152,'2. Communication Costs'!K:K)","v":0},{"$f":"SUMIF('3. Travel & Subsistence costs'!B:B,'Breakdown & Project Funding'!C152,'3. Travel & Subsistence costs'!R:R)","v":0},{"$f":"SUMIF('4. Personnel  costs'!B:B,'Breakdown & Project Funding'!C152,'4. Personnel  costs'!W:W)","v":0},null,0]
[null,{"$f":"IF('Action  Plan'!C96=\"\",\"\",'Action  Plan'!C96)","v":""},"A77",{"$f":"SUMIF('1. Costs linked to activities'!B:B,C153,'1. Costs linked to activities'!K:K)","v":0},{"$f":"SUMIF('2. Communication Costs'!B:B,C153,'2. Communication Costs'!K:K)","v":0},{"$f":"SUMIF('3. Travel & Subsistence costs'!B:B,'Breakdown & Project Funding'!C153,'3. Travel & Subsistence costs'!R:R)","v":0},{"$f":"SUMIF('4. Personnel  costs'!B:B,'Breakdown & Project Funding'!C153,'4. Personnel  costs'!W:W)","v":0},null,0]
[null,{"$f":"IF('Action  Plan'!C97=\"\",\"\",'Action  Plan'!C97)","v":""},"A78",{"$f":"SUMIF('1. Costs linked to activities'!B:B,C154,'1. Costs linked to activities'!K:K)","v":0},{"$f":"SUMIF('2. Communication Costs'!B:B,C154,'2. Communication Costs'!K:K)","v":0},{"$f":"SUMIF('3. Travel & Subsistence costs'!B:B,'Breakdown & Project Funding'!C154,'3. Travel & Subsistence costs'!R:R)","v":0},{"$f":"SUMIF('4. Personnel  costs'!B:B,'Breakdown & Project Funding'!C154,'4. Personnel  costs'!W:W)","v":0},null,0]
[null,{"$f":"IF('Action  Plan'!C98=\"\",\"\",'Action  Plan'!C98)","v":""},"A79",{"$f":"SUMIF('1. Costs linked to activities'!B:B,C155,'1. Costs linked to activities'!K:K)","v":0},{"$f":"SUMIF('2. Communication Costs'!B:B,C155,'2. Communication Costs'!K:K)","v":0},{"$f":"SUMIF('3. Travel & Subsistence costs'!B:B,'Breakdown & Project Funding'!C155,'3. Travel & Subsistence costs'!R:R)","v":0},{"$f":"SUMIF('4. Personnel  costs'!B:B,'Breakdown & Project Funding'!C155,'4. Personnel  costs'!W:W)","v":0},null,0]
[null,{"$f":"IF('Action  Plan'!C99=\"\",\"\",'Action  Plan'!C99)","v":""},"A80",{"$f":"SUMIF('1. Costs linked to activities'!B:B,C156,'1. Costs linked to activities'!K:K)","v":0},{"$f":"SUMIF('2. Communication Costs'!B:B,C156,'2. Communication Costs'!K:K)","v":0},{"$f":"SUMIF('3. Travel & Subsistence costs'!B:B,'Breakdown & Project Funding'!C156,'3. Travel & Subsistence costs'!R:R)","v":0},{"$f":"SUMIF('4. Personnel  costs'!B:B,'Breakdown & Project Funding'!C156,'4. Personnel  costs'!W:W)","v":0},null,0]
[null,{"$f":"IF('Action  Plan'!C100=\"\",\"\",'Action  Plan'!C100)","v":""},"A81",{"$f":"SUMIF('1. Costs linked to activities'!B:B,C157,'1. Costs linked to activities'!K:K)","v":0},{"$f":"SUMIF('2. Communication Costs'!B:B,C157,'2. Communication Costs'!K:K)","v":0},{"$f":"SUMIF('3. Travel & Subsistence costs'!B:B,'Breakdown & Project Funding'!C157,'3. Travel & Subsistence costs'!R:R)","v":0},{"$f":"SUMIF('4. Personnel  costs'!B:B,'Breakdown & Project Funding'!C157,'4. Personnel  costs'!W:W)","v":0},null,0]
[null,{"$f":"IF('Action  Plan'!C101=\"\",\"\",'Action  Plan'!C101)","v":""},"A82",{"$f":"SUMIF('1. Costs linked to activities'!B:B,C158,'1. Costs linked to activities'!K:K)","v":0},{"$f":"SUMIF('2. Communication Costs'!B:B,C158,'2. Communication Costs'!K:K)","v":0},{"$f":"SUMIF('3. Travel & Subsistence costs'!B:B,'Breakdown & Project Funding'!C158,'3. Travel & Subsistence costs'!R:R)","v":0},{"$f":"SUMIF('4. Personnel  costs'!B:B,'Breakdown & Project Funding'!C158,'4. Personnel  costs'!W:W)","v":0},null,0]
[null,{"$f":"IF('Action  Plan'!C102=\"\",\"\",'Action  Plan'!C102)","v":""},"A83",{"$f":"SUMIF('1. Costs linked to activities'!B:B,C159,'1. Costs linked to activities'!K:K)","v":0},{"$f":"SUMIF('2. Communication Costs'!B:B,C159,'2. Communication Costs'!K:K)","v":0},{"$f":"SUMIF('3. Travel & Subsistence costs'!B:B,'Breakdown & Project Funding'!C159,'3. Travel & Subsistence costs'!R:R)","v":0},{"$f":"SUMIF('4. Personnel  costs'!B:B,'Breakdown & Project Funding'!C159,'4. Personnel  costs'!W:W)","v":0},null,0]
[null,{"$f":"IF('Action  Plan'!C103=\"\",\"\",'Action  Plan'!C103)","v":""},"A84",{"$f":"SUMIF('1. Costs linked to activities'!B:B,C160,'1. Costs linked to activities'!K:K)","v":0},{"$f":"SUMIF('2. Communication Costs'!B:B,C160,'2. Communication Costs'!K:K)","v":0},{"$f":"SUMIF('3. Travel & Subsistence costs'!B:B,'Breakdown & Project Funding'!C160,'3. Travel & Subsistence costs'!R:R)","v":0},{"$f":"SUMIF('4. Personnel  costs'!B:B,'Breakdown & Project Funding'!C160,'4. Personnel  costs'!W:W)","v":0},null,0]
[null,{"$f":"IF('Action  Plan'!C104=\"\",\"\",'Action  Plan'!C104)","v":""},"A85",{"$f":"SUMIF('1. Costs linked to activities'!B:B,C161,'1. Costs linked to activities'!K:K)","v":0},{"$f":"SUMIF('2. Communication Costs'!B:B,C161,'2. Communication Costs'!K:K)","v":0},{"$f":"SUMIF('3. Travel & Subsistence costs'!B:B,'Breakdown & Project Funding'!C161,'3. Travel & Subsistence costs'!R:R)","v":0},{"$f":"SUMIF('4. Personnel  costs'!B:B,'Breakdown & Project Funding'!C161,'4. Personnel  costs'!W:W)","v":0},null,0]
[null,{"$f":"IF('Action  Plan'!C105=\"\",\"\",'Action  Plan'!C105)","v":""},"A86",{"$f":"SUMIF('1. Costs linked to activities'!B:B,C162,'1. Costs linked to activities'!K:K)","v":0},{"$f":"SUMIF('2. Communication Costs'!B:B,C162,'2. Communication Costs'!K:K)","v":0},{"$f":"SUMIF('3. Travel & Subsistence costs'!B:B,'Breakdown & Project Funding'!C162,'3. Travel & Subsistence costs'!R:R)","v":0},{"$f":"SUMIF('4. Personnel  costs'!B:B,'Breakdown & Project Funding'!C162,'4. Personnel  costs'!W:W)","v":0},null,0]
[null,{"$f":"IF('Action  Plan'!C106=\"\",\"\",'Action  Plan'!C106)","v":""},"A87",{"$f":"SUMIF('1. Costs linked to activities'!B:B,C163,'1. Costs linked to activities'!K:K)","v":0},{"$f":"SUMIF('2. Communication Costs'!B:B,C163,'2. Communication Costs'!K:K)","v":0},{"$f":"SUMIF('3. Travel & Subsistence costs'!B:B,'Breakdown & Project Funding'!C163,'3. Travel & Subsistence costs'!R:R)","v":0},{"$f":"SUMIF('4. Personnel  costs'!B:B,'Breakdown & Project Funding'!C163,'4. Personnel  costs'!W:W)","v":0},null,0]
[null,{"$f":"IF('Action  Plan'!C107=\"\",\"\",'Action  Plan'!C107)","v":""},"A88",{"$f":"SUMIF('1. Costs linked to activities'!B:B,C164,'1. Costs linked to activities'!K:K)","v":0},{"$f":"SUMIF('2. Communication Costs'!B:B,C164,'2. Communication Costs'!K:K)","v":0},{"$f":"SUMIF('3. Travel & Subsistence costs'!B:B,'Breakdown & Project Funding'!C164,'3. Travel & Subsistence costs'!R:R)","v":0},{"$f":"SUMIF('4. Personnel  costs'!B:B,'Breakdown & Project Funding'!C164,'4. Personnel  costs'!W:W)","v":0},null,0]
[null,{"$f":"IF('Action  Plan'!C108=\"\",\"\",'Action  Plan'!C108)","v":""},"A89",{"$f":"SUMIF('1. Costs linked to activities'!B:B,C165,'1. Costs linked to activities'!K:K)","v":0},{"$f":"SUMIF('2. Communication Costs'!B:B,C165,'2. Communication Costs'!K:K)","v":0},{"$f":"SUMIF('3. Travel & Subsistence costs'!B:B,'Breakdown & Project Funding'!C165,'3. Travel & Subsistence costs'!R:R)","v":0},{"$f":"SUMIF('4. Personnel  costs'!B:B,'Breakdown & Project Funding'!C165,'4. Personnel  costs'!W:W)","v":0},null,0]
[null,{"$f":"IF('Action  Plan'!C109=\"\",\"\",'Action  Plan'!C109)","v":""},"A90",{"$f":"SUMIF('1. Costs linked to activities'!B:B,C166,'1. Costs linked to activities'!K:K)","v":0},{"$f":"SUMIF('2. Communication Costs'!B:B,C166,'2. Communication Costs'!K:K)","v":0},{"$f":"SUMIF('3. Travel & Subsistence costs'!B:B,'Breakdown & Project Funding'!C166,'3. Travel & Subsistence costs'!R:R)","v":0},{"$f":"SUMIF('4. Personnel  costs'!B:B,'Breakdown & Project Funding'!C166,'4. Personnel  costs'!W:W)","v":0},null,0]
[null,{"$f":"IF('Action  Plan'!C110=\"\",\"\",'Action  Plan'!C110)","v":""},"A91",{"$f":"SUMIF('1. Costs linked to activities'!B:B,C167,'1. Costs linked to activities'!K:K)","v":0},{"$f":"SUMIF('2. Communication Costs'!B:B,C167,'2. Communication Costs'!K:K)","v":0},{"$f":"SUMIF('3. Travel & Subsistence costs'!B:B,'Breakdown & Project Funding'!C167,'3. Travel & Subsistence costs'!R:R)","v":0},{"$f":"SUMIF('4. Personnel  costs'!B:B,'Breakdown & Project Funding'!C167,'4. Personnel  costs'!W:W)","v":0},null,0]
[null,{"$f":"IF('Action  Plan'!C111=\"\",\"\",'Action  Plan'!C111)","v":""},"A92",{"$f":"SUMIF('1. Costs linked to activities'!B:B,C168,'1. Costs linked to activities'!K:K)","v":0},{"$f":"SUMIF('2. Communication Costs'!B:B,C168,'2. Communication Costs'!K:K)","v":0},{"$f":"SUMIF('3. Travel & Subsistence costs'!B:B,'Breakdown & Project Funding'!C168,'3. Travel & Subsistence costs'!R:R)","v":0},{"$f":"SUMIF('4. Personnel  costs'!B:B,'Breakdown & Project Funding'!C168,'4. Personnel  costs'!W:W)","v":0},null,0]
[null,{"$f":"IF('Action  Plan'!C112=\"\",\"\",'Action  Plan'!C112)","v":""},"A93",{"$f":"SUMIF('1. Costs linked to activities'!B:B,C169,'1. Costs linked to activities'!K:K)","v":0},{"$f":"SUMIF('2. Communication Costs'!B:B,C169,'2. Communication Costs'!K:K)","v":0},{"$f":"SUMIF('3. Travel & Subsistence costs'!B:B,'Breakdown & Project Funding'!C169,'3. Travel & Subsistence costs'!R:R)","v":0},{"$f":"SUMIF('4. Personnel  costs'!B:B,'Breakdown & Project Funding'!C169,'4. Personnel  costs'!W:W)","v":0},null,0]
[null,{"$f":"IF('Action  Plan'!C113=\"\",\"\",'Action  Plan'!C113)","v":""},"A94",{"$f":"SUMIF('1. Costs linked to activities'!B:B,C170,'1. Costs linked to activities'!K:K)","v":0},{"$f":"SUMIF('2. Communication Costs'!B:B,C170,'2. Communication Costs'!K:K)","v":0},{"$f":"SUMIF('3. Travel & Subsistence costs'!B:B,'Breakdown & Project Funding'!C170,'3. Travel & Subsistence costs'!R:R)","v":0},{"$f":"SUMIF('4. Personnel  costs'!B:B,'Breakdown & Project Funding'!C170,'4. Personnel  costs'!W:W)","v":0},null,0]
[null,{"$f":"IF('Action  Plan'!C114=\"\",\"\",'Action  Plan'!C114)","v":""},"A95",{"$f":"SUMIF('1. Costs linked to activities'!B:B,C171,'1. Costs linked to activities'!K:K)","v":0},{"$f":"SUMIF('2. Communication Costs'!B:B,C171,'2. Communication Costs'!K:K)","v":0},{"$f":"SUMIF('3. Travel & Subsistence costs'!B:B,'Breakdown & Project Funding'!C171,'3. Travel & Subsistence costs'!R:R)","v":0},{"$f":"SUMIF('4. Personnel  costs'!B:B,'Breakdown & Project Funding'!C171,'4. Personnel  costs'!W:W)","v":0},null,0]
[null,{"$f":"IF('Action  Plan'!C115=\"\",\"\",'Action  Plan'!C115)","v":""},"A96",{"$f":"SUMIF('1. Costs linked to activities'!B:B,C172,'1. Costs linked to activities'!K:K)","v":0},{"$f":"SUMIF('2. Communication Costs'!B:B,C172,'2. Communication Costs'!K:K)","v":0},{"$f":"SUMIF('3. Travel & Subsistence costs'!B:B,'Breakdown & Project Funding'!C172,'3. Travel & Subsistence costs'!R:R)","v":0},{"$f":"SUMIF('4. Personnel  costs'!B:B,'Breakdown & Project Funding'!C172,'4. Personnel  costs'!W:W)","v":0},null,0]
[null,{"$f":"IF('Action  Plan'!C116=\"\",\"\",'Action  Plan'!C116)","v":""},"A97",{"$f":"SUMIF('1. Costs linked to activities'!B:B,C173,'1. Costs linked to activities'!K:K)","v":0},{"$f":"SUMIF('2. Communication Costs'!B:B,C173,'2. Communication Costs'!K:K)","v":0},{"$f":"SUMIF('3. Travel & Subsistence costs'!B:B,'Breakdown & Project Funding'!C173,'3. Travel & Subsistence costs'!R:R)","v":0},{"$f":"SUMIF('4. Personnel  costs'!B:B,'Breakdown & Project Funding'!C173,'4. Personnel  costs'!W:W)","v":0},null,0]
[null,{"$f":"IF('Action  Plan'!C117=\"\",\"\",'Action  Plan'!C117)","v":""},"A98",{"$f":"SUMIF('1. Costs linked to activities'!B:B,C174,'1. Costs linked to activities'!K:K)","v":0},{"$f":"SUMIF('2. Communication Costs'!B:B,C174,'2. Communication Costs'!K:K)","v":0},{"$f":"SUMIF('3. Travel & Subsistence costs'!B:B,'Breakdown & Project Funding'!C174,'3. Travel & Subsistence costs'!R:R)","v":0},{"$f":"SUMIF('4. Personnel  costs'!B:B,'Breakdown & Project Funding'!C174,'4. Personnel  costs'!W:W)","v":0},null,0]
[null,{"$f":"IF('Action  Plan'!C118=\"\",\"\",'Action  Plan'!C118)","v":""},"A99",{"$f":"SUMIF('1. Costs linked to activities'!B:B,C175,'1. Costs linked to activities'!K:K)","v":0},{"$f":"SUMIF('2. Communication Costs'!B:B,C175,'2. Communication Costs'!K:K)","v":0},{"$f":"SUMIF('3. Travel & Subsistence costs'!B:B,'Breakdown & Project Funding'!C175,'3. Travel & Subsistence costs'!R:R)","v":0},{"$f":"SUMIF('4. Personnel  costs'!B:B,'Breakdown & Project Funding'!C175,'4. Personnel  costs'!W:W)","v":0},null,0]
[null,{"$f":"IF('Action  Plan'!C119=\"\",\"\",'Action  Plan'!C119)","v":""},"A100",{"$f":"SUMIF('1. Costs linked to activities'!B:B,C176,'1. Costs linked to activities'!K:K)","v":0},{"$f":"SUMIF('2. Communication Costs'!B:B,C176,'2. Communication Costs'!K:K)","v":0},{"$f":"SUMIF('3. Travel & Subsistence costs'!B:B,'Breakdown & Project Funding'!C176,'3. Travel & Subsistence costs'!R:R)","v":0},{"$f":"SUMIF('4. Personnel  costs'!B:B,'Breakdown & Project Funding'!C176,'4. Personnel  costs'!W:W)","v":0},null,0]
[null,{"$f":"IF('Action  Plan'!C120=\"\",\"\",'Action  Plan'!C120)","v":""},"A101",{"$f":"SUMIF('1. Costs linked to activities'!B:B,C177,'1. Costs linked to activities'!K:K)","v":0},{"$f":"SUMIF('2. Communication Costs'!B:B,C177,'2. Communication Costs'!K:K)","v":0},{"$f":"SUMIF('3. Travel & Subsistence costs'!B:B,'Breakdown & Project Funding'!C177,'3. Travel & Subsistence costs'!R:R)","v":0},{"$f":"SUMIF('4. Personnel  costs'!B:B,'Breakdown & Project Funding'!C177,'4. Personnel  costs'!W:W)","v":0},null,0]
[null,{"$f":"IF('Action  Plan'!C121=\"\",\"\",'Action  Plan'!C121)","v":""},"A102",{"$f":"SUMIF('1. Costs linked to activities'!B:B,C178,'1. Costs linked to activities'!K:K)","v":0},{"$f":"SUMIF('2. Communication Costs'!B:B,C178,'2. Communication Costs'!K:K)","v":0},{"$f":"SUMIF('3. Travel & Subsistence costs'!B:B,'Breakdown & Project Funding'!C178,'3. Travel & Subsistence costs'!R:R)","v":0},{"$f":"SUMIF('4. Personnel  costs'!B:B,'Breakdown & Project Funding'!C178,'4. Personnel  costs'!W:W)","v":0},null,0]
[null,{"$f":"IF('Action  Plan'!C122=\"\",\"\",'Action  Plan'!C122)","v":""},"A103",{"$f":"SUMIF('1. Costs linked to activities'!B:B,C179,'1. Costs linked to activities'!K:K)","v":0},{"$f":"SUMIF('2. Communication Costs'!B:B,C179,'2. Communication Costs'!K:K)","v":0},{"$f":"SUMIF('3. Travel & Subsistence costs'!B:B,'Breakdown & Project Funding'!C179,'3. Travel & Subsistence costs'!R:R)","v":0},{"$f":"SUMIF('4. Personnel  costs'!B:B,'Breakdown & Project Funding'!C179,'4. Personnel  costs'!W:W)","v":0},null,0]
[null,{"$f":"IF('Action  Plan'!C123=\"\",\"\",'Action  Plan'!C123)","v":""},"A104",{"$f":"SUMIF('1. Costs linked to activities'!B:B,C180,'1. Costs linked to activities'!K:K)","v":0},{"$f":"SUMIF('2. Communication Costs'!B:B,C180,'2. Communication Costs'!K:K)","v":0},{"$f":"SUMIF('3. Travel & Subsistence costs'!B:B,'Breakdown & Project Funding'!C180,'3. Travel & Subsistence costs'!R:R)","v":0},{"$f":"SUMIF('4. Personnel  costs'!B:B,'Breakdown & Project Funding'!C180,'4. Personnel  costs'!W:W)","v":0},null,0]
[null,{"$f":"IF('Action  Plan'!C124=\"\",\"\",'Action  Plan'!C124)","v":""},"A105",{"$f":"SUMIF('1. Costs linked to activities'!B:B,C181,'1. Costs linked to activities'!K:K)","v":0},{"$f":"SUMIF('2. Communication Costs'!B:B,C181,'2. Communication Costs'!K:K)","v":0},{"$f":"SUMIF('3. Travel & Subsistence costs'!B:B,'Breakdown & Project Funding'!C181,'3. Travel & Subsistence costs'!R:R)","v":0},{"$f":"SUMIF('4. Personnel  costs'!B:B,'Breakdown & Project Funding'!C181,'4. Personnel  costs'!W:W)","v":0},null,0]
[null,{"$f":"IF('Action  Plan'!C125=\"\",\"\",'Action  Plan'!C125)","v":""},"A106",{"$f":"SUMIF('1. Costs linked to activities'!B:B,C182,'1. Costs linked to activities'!K:K)","v":0},{"$f":"SUMIF('2. Communication Costs'!B:B,C182,'2. Communication Costs'!K:K)","v":0},{"$f":"SUMIF('3. Travel & Subsistence costs'!B:B,'Breakdown & Project Funding'!C182,'3. Travel & Subsistence costs'!R:R)","v":0},{"$f":"SUMIF('4. Personnel  costs'!B:B,'Breakdown & Project Funding'!C182,'4. Personnel  costs'!W:W)","v":0},null,0]
[null,{"$f":"IF('Action  Plan'!C126=\"\",\"\",'Action  Plan'!C126)","v":""},"A107",{"$f":"SUMIF('1. Costs linked to activities'!B:B,C183,'1. Costs linked to activities'!K:K)","v":0},{"$f":"SUMIF('2. Communication Costs'!B:B,C183,'2. Communication Costs'!K:K)","v":0},{"$f":"SUMIF('3. Travel & Subsistence costs'!B:B,'Breakdown & Project Funding'!C183,'3. Travel & Subsistence costs'!R:R)","v":0},{"$f":"SUMIF('4. Personnel  costs'!B:B,'Breakdown & Project Funding'!C183,'4. Personnel  costs'!W:W)","v":0},null,0]
[null,{"$f":"IF('Action  Plan'!C127=\"\",\"\",'Action  Plan'!C127)","v":""},"A108",{"$f":"SUMIF('1. Costs linked to activities'!B:B,C184,'1. Costs linked to activities'!K:K)","v":0},{"$f":"SUMIF('2. Communication Costs'!B:B,C184,'2. Communication Costs'!K:K)","v":0},{"$f":"SUMIF('3. Travel & Subsistence costs'!B:B,'Breakdown & Project Funding'!C184,'3. Travel & Subsistence costs'!R:R)","v":0},{"$f":"SUMIF('4. Personnel  costs'!B:B,'Breakdown & Project Funding'!C184,'4. Personnel  costs'!W:W)","v":0},null,0]
[null,{"$f":"IF('Action  Plan'!C128=\"\",\"\",'Action  Plan'!C128)","v":""},"A109",{"$f":"SUMIF('1. Costs linked to activities'!B:B,C185,'1. Costs linked to activities'!K:K)","v":0},{"$f":"SUMIF('2. Communication Costs'!B:B,C185,'2. Communication Costs'!K:K)","v":0},{"$f":"SUMIF('3. Travel & Subsistence costs'!B:B,'Breakdown & Project Funding'!C185,'3. Travel & Subsistence costs'!R:R)","v":0},{"$f":"SUMIF('4. Personnel  costs'!B:B,'Breakdown & Project Funding'!C185,'4. Personnel  costs'!W:W)","v":0},null,0]
[null,{"$f":"IF('Action  Plan'!C129=\"\",\"\",'Action  Plan'!C129)","v":""},"A110",{"$f":"SUMIF('1. Costs linked to activities'!B:B,C186,'1. Costs linked to activities'!K:K)","v":0},{"$f":"SUMIF('2. Communication Costs'!B:B,C186,'2. Communication Costs'!K:K)","v":0},{"$f":"SUMIF('3. Travel & Subsistence costs'!B:B,'Breakdown & Project Funding'!C186,'3. Travel & Subsistence costs'!R:R)","v":0},{"$f":"SUMIF('4. Personnel  costs'!B:B,'Breakdown & Project Funding'!C186,'4. Personnel  costs'!W:W)","v":0},null,0]
[null,{"$f":"IF('Action  Plan'!C130=\"\",\"\",'Action  Plan'!C130)","v":""},"A111",{"$f":"SUMIF('1. Costs linked to activities'!B:B,C187,'1. Costs linked to activities'!K:K)","v":0},{"$f":"SUMIF('2. Communication Costs'!B:B,C187,'2. Communication Costs'!K:K)","v":0},{"$f":"SUMIF('3. Travel & Subsistence costs'!B:B,'Breakdown & Project Funding'!C187,'3. Travel & Subsistence costs'!R:R)","v":0},{"$f":"SUMIF('4. Personnel  costs'!B:B,'Breakdown & Project Funding'!C187,'4. Personnel  costs'!W:W)","v":0},null,0]
[null,{"$f":"IF('Action  Plan'!C131=\"\",\"\",'Action  Plan'!C131)","v":""},"A112",{"$f":"SUMIF('1. Costs linked to activities'!B:B,C188,'1. Costs linked to activities'!K:K)","v":0},{"$f":"SUMIF('2. Communication Costs'!B:B,C188,'2. Communication Costs'!K:K)","v":0},{"$f":"SUMIF('3. Travel & Subsistence costs'!B:B,'Breakdown & Project Funding'!C188,'3. Travel & Subsistence costs'!R:R)","v":0},{"$f":"SUMIF('4. Personnel  costs'!B:B,'Breakdown & Project Funding'!C188,'4. Personnel  costs'!W:W)","v":0},null,0]
[null,{"$f":"IF('Action  Plan'!C132=\"\",\"\",'Action  Plan'!C132)","v":""},"A113",{"$f":"SUMIF('1. Costs linked to activities'!B:B,C189,'1. Costs linked to activities'!K:K)","v":0},{"$f":"SUMIF('2. Communication Costs'!B:B,C189,'2. Communication Costs'!K:K)","v":0},{"$f":"SUMIF('3. Travel & Subsistence costs'!B:B,'Breakdown & Project Funding'!C189,'3. Travel & Subsistence costs'!R:R)","v":0},{"$f":"SUMIF('4. Personnel  costs'!B:B,'Breakdown & Project Funding'!C189,'4. Personnel  costs'!W:W)","v":0},null,0]
[null,{"$f":"IF('Action  Plan'!C133=\"\",\"\",'Action  Plan'!C133)","v":""},"A114",{"$f":"SUMIF('1. Costs linked to activities'!B:B,C190,'1. Costs linked to activities'!K:K)","v":0},{"$f":"SUMIF('2. Communication Costs'!B:B,C190,'2. Communication Costs'!K:K)","v":0},{"$f":"SUMIF('3. Travel & Subsistence costs'!B:B,'Breakdown & Project Funding'!C190,'3. Travel & Subsistence costs'!R:R)","v":0},{"$f":"SUMIF('4. Personnel  costs'!B:B,'Breakdown & Project Funding'!C190,'4. Personnel  costs'!W:W)","v":0},null,0]
[null,{"$f":"IF('Action  Plan'!C134=\"\",\"\",'Action  Plan'!C134)","v":""},"A115",{"$f":"SUMIF('1. Costs linked to activities'!B:B,C191,'1. Costs linked to activities'!K:K)","v":0},{"$f":"SUMIF('2. Communication Costs'!B:B,C191,'2. Communication Costs'!K:K)","v":0},{"$f":"SUMIF('3. Travel & Subsistence costs'!B:B,'Breakdown & Project Funding'!C191,'3. Travel & Subsistence costs'!R:R)","v":0},{"$f":"SUMIF('4. Personnel  costs'!B:B,'Breakdown & Project Funding'!C191,'4. Personnel  costs'!W:W)","v":0},null,0]
[null,{"$f":"IF('Action  Plan'!C135=\"\",\"\",'Action  Plan'!C135)","v":""},"A116",{"$f":"SUMIF('1. Costs linked to activities'!B:B,C192,'1. Costs linked to activities'!K:K)","v":0},{"$f":"SUMIF('2. Communication Costs'!B:B,C192,'2. Communication Costs'!K:K)","v":0},{"$f":"SUMIF('3. Travel & Subsistence costs'!B:B,'Breakdown & Project Funding'!C192,'3. Travel & Subsistence costs'!R:R)","v":0},{"$f":"SUMIF('4. Personnel  costs'!B:B,'Breakdown & Project Funding'!C192,'4. Personnel  costs'!W:W)","v":0},null,0]
[null,{"$f":"IF('Action  Plan'!C136=\"\",\"\",'Action  Plan'!C136)","v":""},"A117",{"$f":"SUMIF('1. Costs linked to activities'!B:B,C193,'1. Costs linked to activities'!K:K)","v":0},{"$f":"SUMIF('2. Communication Costs'!B:B,C193,'2. Communication Costs'!K:K)","v":0},{"$f":"SUMIF('3. Travel & Subsistence costs'!B:B,'Breakdown & Project Funding'!C193,'3. Travel & Subsistence costs'!R:R)","v":0},{"$f":"SUMIF('4. Personnel  costs'!B:B,'Breakdown & Project Funding'!C193,'4. Personnel  costs'!W:W)","v":0},null,0]
[null,{"$f":"IF('Action  Plan'!C137=\"\",\"\",'Action  Plan'!C137)","v":""},"A118",{"$f":"SUMIF('1. Costs linked to activities'!B:B,C194,'1. Costs linked to activities'!K:K)","v":0},{"$f":"SUMIF('2. Communication Costs'!B:B,C194,'2. Communication Costs'!K:K)","v":0},{"$f":"SUMIF('3. Travel & Subsistence costs'!B:B,'Breakdown & Project Funding'!C194,'3. Travel & Subsistence costs'!R:R)","v":0},{"$f":"SUMIF('4. Personnel  costs'!B:B,'Breakdown & Project Funding'!C194,'4. Personnel  costs'!W:W)","v":0},null,0]
[null,{"$f":"IF('Action  Plan'!C138=\"\",\"\",'Action  Plan'!C138)","v":""},"A119",{"$f":"SUMIF('1. Costs linked to activities'!B:B,C195,'1. Costs linked to activities'!K:K)","v":0},{"$f":"SUMIF('2. Communication Costs'!B:B,C195,'2. Communication Costs'!K:K)","v":0},{"$f":"SUMIF('3. Travel & Subsistence costs'!B:B,'Breakdown & Project Funding'!C195,'3. Travel & Subsistence costs'!R:R)","v":0},{"$f":"SUMIF('4. Personnel  costs'!B:B,'Breakdown & Project Funding'!C195,'4. Personnel  costs'!W:W)","v":0},null,0]
[null,{"$f":"IF('Action  Plan'!C139=\"\",\"\",'Action  Plan'!C139)","v":""},"A120",{"$f":"SUMIF('1. Costs linked to activities'!B:B,C196,'1. Costs linked to activities'!K:K)","v":0},{"$f":"SUMIF('2. Communication Costs'!B:B,C196,'2. Communication Costs'!K:K)","v":0},{"$f":"SUMIF('3. Travel & Subsistence costs'!B:B,'Breakdown & Project Funding'!C196,'3. Travel & Subsistence costs'!R:R)","v":0},{"$f":"SUMIF('4. Personnel  costs'!B:B,'Breakdown & Project Funding'!C196,'4. Personnel  costs'!W:W)","v":0},null,0]
[null,{"$f":"IF('Action  Plan'!C140=\"\",\"\",'Action  Plan'!C140)","v":""},"A121",{"$f":"SUMIF('1. Costs linked to activities'!B:B,C197,'1. Costs linked to activities'!K:K)","v":0},{"$f":"SUMIF('2. Communication Costs'!B:B,C197,'2. Communication Costs'!K:K)","v":0},{"$f":"SUMIF('3. Travel & Subsistence costs'!B:B,'Breakdown & Project Funding'!C197,'3. Travel & Subsistence costs'!R:R)","v":0},{"$f":"SUMIF('4. Personnel  costs'!B:B,'Breakdown & Project Funding'!C197,'4. Personnel  costs'!W:W)","v":0},null,0]
[null,{"$f":"IF('Action  Plan'!C141=\"\",\"\",'Action  Plan'!C141)","v":""},"A122",{"$f":"SUMIF('1. Costs linked to activities'!B:B,C198,'1. Costs linked to activities'!K:K)","v":0},{"$f":"SUMIF('2. Communication Costs'!B:B,C198,'2. Communication Costs'!K:K)","v":0},{"$f":"SUMIF('3. Travel & Subsistence costs'!B:B,'Breakdown & Project Funding'!C198,'3. Travel & Subsistence costs'!R:R)","v":0},{"$f":"SUMIF('4. Personnel  costs'!B:B,'Breakdown & Project Funding'!C198,'4. Personnel  costs'!W:W)","v":0},null,0]
[null,{"$f":"IF('Action  Plan'!C142=\"\",\"\",'Action  Plan'!C142)","v":""},"A123",{"$f":"SUMIF('1. Costs linked to activities'!B:B,C199,'1. Costs linked to activities'!K:K)","v":0},{"$f":"SUMIF('2. Communication Costs'!B:B,C199,'2. Communication Costs'!K:K)","v":0},{"$f":"SUMIF('3. Travel & Subsistence costs'!B:B,'Breakdown & Project Funding'!C199,'3. Travel & Subsistence costs'!R:R)","v":0},{"$f":"SUMIF('4. Personnel  costs'!B:B,'Breakdown & Project Funding'!C199,'4. Personnel  costs'!W:W)","v":0},null,0]
[null,{"$f":"IF('Action  Plan'!C143=\"\",\"\",'Action  Plan'!C143)","v":""},"A124",{"$f":"SUMIF('1. Costs linked to activities'!B:B,C200,'1. Costs linked to activities'!K:K)","v":0},{"$f":"SUMIF('2. Communication Costs'!B:B,C200,'2. Communication Costs'!K:K)","v":0},{"$f":"SUMIF('3. Travel & Subsistence costs'!B:B,'Breakdown & Project Funding'!C200,'3. Travel & Subsistence costs'!R:R)","v":0},{"$f":"SUMIF('4. Personnel  costs'!B:B,'Breakdown & Project Funding'!C200,'4. Personnel  costs'!W:W)","v":0},null,0]
[null,{"$f":"IF('Action  Plan'!C144=\"\",\"\",'Action  Plan'!C144)","v":""},"A125",{"$f":"SUMIF('1. Costs linked to activities'!B:B,C201,'1. Costs linked to activities'!K:K)","v":0},{"$f":"SUMIF('2. Communication Costs'!B:B,C201,'2. Communication Costs'!K:K)","v":0},{"$f":"SUMIF('3. Travel & Subsistence costs'!B:B,'Breakdown & Project Funding'!C201,'3. Travel & Subsistence costs'!R:R)","v":0},{"$f":"SUMIF('4. Personnel  costs'!B:B,'Breakdown & Project Funding'!C201,'4. Personnel  costs'!W:W)","v":0},null,0]
[null,{"$f":"IF('Action  Plan'!C145=\"\",\"\",'Action  Plan'!C145)","v":""},"A126",{"$f":"SUMIF('1. Costs linked to activities'!B:B,C202,'1. Costs linked to activities'!K:K)","v":0},{"$f":"SUMIF('2. Communication Costs'!B:B,C202,'2. Communication Costs'!K:K)","v":0},{"$f":"SUMIF('3. Travel & Subsistence costs'!B:B,'Breakdown & Project Funding'!C202,'3. Travel & Subsistence costs'!R:R)","v":0},{"$f":"SUMIF('4. Personnel  costs'!B:B,'Breakdown & Project Funding'!C202,'4. Personnel  costs'!W:W)","v":0},null,0]
[null,{"$f":"IF('Action  Plan'!C146=\"\",\"\",'Action  Plan'!C146)","v":""},"A127",{"$f":"SUMIF('1. Costs linked to activities'!B:B,C203,'1. Costs linked to activities'!K:K)","v":0},{"$f":"SUMIF('2. Communication Costs'!B:B,C203,'2. Communication Costs'!K:K)","v":0},{"$f":"SUMIF('3. Travel & Subsistence costs'!B:B,'Breakdown & Project Funding'!C203,'3. Travel & Subsistence costs'!R:R)","v":0},{"$f":"SUMIF('4. Personnel  costs'!B:B,'Breakdown & Project Funding'!C203,'4. Personnel  costs'!W:W)","v":0},null,0]
[null,{"$f":"IF('Action  Plan'!C147=\"\",\"\",'Action  Plan'!C147)","v":""},"A128",{"$f":"SUMIF('1. Costs linked to activities'!B:B,C204,'1. Costs linked to activities'!K:K)","v":0},{"$f":"SUMIF('2. Communication Costs'!B:B,C204,'2. Communication Costs'!K:K)","v":0},{"$f":"SUMIF('3. Travel & Subsistence costs'!B:B,'Breakdown & Project Funding'!C204,'3. Travel & Subsistence costs'!R:R)","v":0},{"$f":"SUMIF('4. Personnel  costs'!B:B,'Breakdown & Project Funding'!C204,'4. Personnel  costs'!W:W)","v":0},null,0]
[null,{"$f":"IF('Action  Plan'!C148=\"\",\"\",'Action  Plan'!C148)","v":""},"A129",{"$f":"SUMIF('1. Costs linked to activities'!B:B,C205,'1. Costs linked to activities'!K:K)","v":0},{"$f":"SUMIF('2. Communication Costs'!B:B,C205,'2. Communication Costs'!K:K)","v":0},{"$f":"SUMIF('3. Travel & Subsistence costs'!B:B,'Breakdown & Project Funding'!C205,'3. Travel & Subsistence costs'!R:R)","v":0},{"$f":"SUMIF('4. Personnel  costs'!B:B,'Breakdown & Project Funding'!C205,'4. Personnel  costs'!W:W)","v":0},null,0]
[null,{"$f":"IF('Action  Plan'!C149=\"\",\"\",'Action  Plan'!C149)","v":""},"A130",{"$f":"SUMIF('1. Costs linked to activities'!B:B,C206,'1. Costs linked to activities'!K:K)","v":0},{"$f":"SUMIF('2. Communication Costs'!B:B,C206,'2. Communication Costs'!K:K)","v":0},{"$f":"SUMIF('3. Travel & Subsistence costs'!B:B,'Breakdown & Project Funding'!C206,'3. Travel & Subsistence costs'!R:R)","v":0},{"$f":"SUMIF('4. Personnel  costs'!B:B,'Breakdown & Project Funding'!C206,'4. Personnel  costs'!W:W)","v":0},null,{"$f":"SUM(D206:H206)","v":0}]
[null,{"$f":"IF('Action  Plan'!C150=\"\",\"\",'Action  Plan'!C150)","v":""},"A131",{"$f":"SUMIF('1. Costs linked to activities'!B:B,C207,'1. Costs linked to activities'!K:K)","v":0},{"$f":"SUMIF('2. Communication Costs'!B:B,C207,'2. Communication Costs'!K:K)","v":0},{"$f":"SUMIF('3. Travel & Subsistence costs'!B:B,'Breakdown & Project Funding'!C207,'3. Travel & Subsistence costs'!R:R)","v":0},{"$f":"SUMIF('4. Personnel  costs'!B:B,'Breakdown & Project Funding'!C207,'4. Personnel  costs'!W:W)","v":0},null,0]
[null,{"$f":"IF('Action  Plan'!C151=\"\",\"\",'Action  Plan'!C151)","v":""},"A132",{"$f":"SUMIF('1. Costs linked to activities'!B:B,C208,'1. Costs linked to activities'!K:K)","v":0},{"$f":"SUMIF('2. Communication Costs'!B:B,C208,'2. Communication Costs'!K:K)","v":0},{"$f":"SUMIF('3. Travel & Subsistence costs'!B:B,'Breakdown & Project Funding'!C208,'3. Travel & Subsistence costs'!R:R)","v":0},{"$f":"SUMIF('4. Personnel  costs'!B:B,'Breakdown & Project Funding'!C208,'4. Personnel  costs'!W:W)","v":0},null,0]
[null,{"$f":"IF('Action  Plan'!C152=\"\",\"\",'Action  Plan'!C152)","v":""},"A133",{"$f":"SUMIF('1. Costs linked to activities'!B:B,C209,'1. Costs linked to activities'!K:K)","v":0},{"$f":"SUMIF('2. Communication Costs'!B:B,C209,'2. Communication Costs'!K:K)","v":0},{"$f":"SUMIF('3. Travel & Subsistence costs'!B:B,'Breakdown & Project Funding'!C209,'3. Travel & Subsistence costs'!R:R)","v":0},{"$f":"SUMIF('4. Personnel  costs'!B:B,'Breakdown & Project Funding'!C209,'4. Personnel  costs'!W:W)","v":0},null,0]
[null,{"$f":"IF('Action  Plan'!C153=\"\",\"\",'Action  Plan'!C153)","v":""},"A134",{"$f":"SUMIF('1. Costs linked to activities'!B:B,C210,'1. Costs linked to activities'!K:K)","v":0},{"$f":"SUMIF('2. Communication Costs'!B:B,C210,'2. Communication Costs'!K:K)","v":0},{"$f":"SUMIF('3. Travel & Subsistence costs'!B:B,'Breakdown & Project Funding'!C210,'3. Travel & Subsistence costs'!R:R)","v":0},{"$f":"SUMIF('4. Personnel  costs'!B:B,'Breakdown & Project Funding'!C210,'4. Personnel  costs'!W:W)","v":0},null,0]
[null,{"$f":"IF('Action  Plan'!C154=\"\",\"\",'Action  Plan'!C154)","v":""},"A135",{"$f":"SUMIF('1. Costs linked to activities'!B:B,C211,'1. Costs linked to activities'!K:K)","v":0},{"$f":"SUMIF('2. Communication Costs'!B:B,C211,'2. Communication Costs'!K:K)","v":0},{"$f":"SUMIF('3. Travel & Subsistence costs'!B:B,'Breakdown & Project Funding'!C211,'3. Travel & Subsistence costs'!R:R)","v":0},{"$f":"SUMIF('4. Personnel  costs'!B:B,'Breakdown & Project Funding'!C211,'4. Personnel  costs'!W:W)","v":0},null,0]
[null,{"$f":"IF('Action  Plan'!C155=\"\",\"\",'Action  Plan'!C155)","v":""},"A136",{"$f":"SUMIF('1. Costs linked to activities'!B:B,C212,'1. Costs linked to activities'!K:K)","v":0},{"$f":"SUMIF('2. Communication Costs'!B:B,C212,'2. Communication Costs'!K:K)","v":0},{"$f":"SUMIF('3. Travel & Subsistence costs'!B:B,'Breakdown & Project Funding'!C212,'3. Travel & Subsistence costs'!R:R)","v":0},{"$f":"SUMIF('4. Personnel  costs'!B:B,'Breakdown & Project Funding'!C212,'4. Personnel  costs'!W:W)","v":0},null,0]
[null,{"$f":"IF('Action  Plan'!C156=\"\",\"\",'Action  Plan'!C156)","v":""},"A137",{"$f":"SUMIF('1. Costs linked to activities'!B:B,C213,'1. Costs linked to activities'!K:K)","v":0},{"$f":"SUMIF('2. Communication Costs'!B:B,C213,'2. Communication Costs'!K:K)","v":0},{"$f":"SUMIF('3. Travel & Subsistence costs'!B:B,'Breakdown & Project Funding'!C213,'3. Travel & Subsistence costs'!R:R)","v":0},{"$f":"SUMIF('4. Personnel  costs'!B:B,'Breakdown & Project Funding'!C213,'4. Personnel  costs'!W:W)","v":0},null,0]
[null,{"$f":"IF('Action  Plan'!C157=\"\",\"\",'Action  Plan'!C157)","v":""},"A138",{"$f":"SUMIF('1. Costs linked to activities'!B:B,C214,'1. Costs linked to activities'!K:K)","v":0},{"$f":"SUMIF('2. Communication Costs'!B:B,C214,'2. Communication Costs'!K:K)","v":0},{"$f":"SUMIF('3. Travel & Subsistence costs'!B:B,'Breakdown & Project Funding'!C214,'3. Travel & Subsistence costs'!R:R)","v":0},{"$f":"SUMIF('4. Personnel  costs'!B:B,'Breakdown & Project Funding'!C214,'4. Personnel  costs'!W:W)","v":0},null,0]
[null,{"$f":"IF('Action  Plan'!C158=\"\",\"\",'Action  Plan'!C158)","v":""},"A139",{"$f":"SUMIF('1. Costs linked to activities'!B:B,C215,'1. Costs linked to activities'!K:K)","v":0},{"$f":"SUMIF('2. Communication Costs'!B:B,C215,'2. Communication Costs'!K:K)","v":0},{"$f":"SUMIF('3. Travel & Subsistence costs'!B:B,'Breakdown & Project Funding'!C215,'3. Travel & Subsistence costs'!R:R)","v":0},{"$f":"SUMIF('4. Personnel  costs'!B:B,'Breakdown & Project Funding'!C215,'4. Personnel  costs'!W:W)","v":0},null,0]
[null,{"$f":"IF('Action  Plan'!C159=\"\",\"\",'Action  Plan'!C159)","v":""},"A140",{"$f":"SUMIF('1. Costs linked to activities'!B:B,C216,'1. Costs linked to activities'!K:K)","v":0},{"$f":"SUMIF('2. Communication Costs'!B:B,C216,'2. Communication Costs'!K:K)","v":0},{"$f":"SUMIF('3. Travel & Subsistence costs'!B:B,'Breakdown & Project Funding'!C216,'3. Travel & Subsistence costs'!R:R)","v":0},{"$f":"SUMIF('4. Personnel  costs'!B:B,'Breakdown & Project Funding'!C216,'4. Personnel  costs'!W:W)","v":0},null,0]
[null,{"$f":"IF('Action  Plan'!C160=\"\",\"\",'Action  Plan'!C160)","v":""},"A141",{"$f":"SUMIF('1. Costs linked to activities'!B:B,C217,'1. Costs linked to activities'!K:K)","v":0},{"$f":"SUMIF('2. Communication Costs'!B:B,C217,'2. Communication Costs'!K:K)","v":0},{"$f":"SUMIF('3. Travel & Subsistence costs'!B:B,'Breakdown & Project Funding'!C217,'3. Travel & Subsistence costs'!R:R)","v":0},{"$f":"SUMIF('4. Personnel  costs'!B:B,'Breakdown & Project Funding'!C217,'4. Personnel  costs'!W:W)","v":0},null,0]
[null,{"$f":"IF('Action  Plan'!C161=\"\",\"\",'Action  Plan'!C161)","v":""},"A142",{"$f":"SUMIF('1. Costs linked to activities'!B:B,C218,'1. Costs linked to activities'!K:K)","v":0},{"$f":"SUMIF('2. Communication Costs'!B:B,C218,'2. Communication Costs'!K:K)","v":0},{"$f":"SUMIF('3. Travel & Subsistence costs'!B:B,'Breakdown & Project Funding'!C218,'3. Travel & Subsistence costs'!R:R)","v":0},{"$f":"SUMIF('4. Personnel  costs'!B:B,'Breakdown & Project Funding'!C218,'4. Personnel  costs'!W:W)","v":0},null,0]
[null,{"$f":"IF('Action  Plan'!C162=\"\",\"\",'Action  Plan'!C162)","v":""},"A143",{"$f":"SUMIF('1. Costs linked to activities'!B:B,C219,'1. Costs linked to activities'!K:K)","v":0},{"$f":"SUMIF('2. Communication Costs'!B:B,C219,'2. Communication Costs'!K:K)","v":0},{"$f":"SUMIF('3. Travel & Subsistence costs'!B:B,'Breakdown & Project Funding'!C219,'3. Travel & Subsistence costs'!R:R)","v":0},{"$f":"SUMIF('4. Personnel  costs'!B:B,'Breakdown & Project Funding'!C219,'4. Personnel  costs'!W:W)","v":0},null,0]
[null,{"$f":"IF('Action  Plan'!C163=\"\",\"\",'Action  Plan'!C163)","v":""},"A144",{"$f":"SUMIF('1. Costs linked to activities'!B:B,C220,'1. Costs linked to activities'!K:K)","v":0},{"$f":"SUMIF('2. Communication Costs'!B:B,C220,'2. Communication Costs'!K:K)","v":0},{"$f":"SUMIF('3. Travel & Subsistence costs'!B:B,'Breakdown & Project Funding'!C220,'3. Travel & Subsistence costs'!R:R)","v":0},{"$f":"SUMIF('4. Personnel  costs'!B:B,'Breakdown & Project Funding'!C220,'4. Personnel  costs'!W:W)","v":0},null,0]
[null,{"$f":"IF('Action  Plan'!C164=\"\",\"\",'Action  Plan'!C164)","v":""},"A145",{"$f":"SUMIF('1. Costs linked to activities'!B:B,C221,'1. Costs linked to activities'!K:K)","v":0},{"$f":"SUMIF('2. Communication Costs'!B:B,C221,'2. Communication Costs'!K:K)","v":0},{"$f":"SUMIF('3. Travel & Subsistence costs'!B:B,'Breakdown & Project Funding'!C221,'3. Travel & Subsistence costs'!R:R)","v":0},{"$f":"SUMIF('4. Personnel  costs'!B:B,'Breakdown & Project Funding'!C221,'4. Personnel  costs'!W:W)","v":0},null,0]
[null,{"$f":"IF('Action  Plan'!C165=\"\",\"\",'Action  Plan'!C165)","v":""},"A146",{"$f":"SUMIF('1. Costs linked to activities'!B:B,C222,'1. Costs linked to activities'!K:K)","v":0},{"$f":"SUMIF('2. Communication Costs'!B:B,C222,'2. Communication Costs'!K:K)","v":0},{"$f":"SUMIF('3. Travel & Subsistence costs'!B:B,'Breakdown & Project Funding'!C222,'3. Travel & Subsistence costs'!R:R)","v":0},{"$f":"SUMIF('4. Personnel  costs'!B:B,'Breakdown & Project Funding'!C222,'4. Personnel  costs'!W:W)","v":0},null,0]
[null,{"$f":"IF('Action  Plan'!C166=\"\",\"\",'Action  Plan'!C166)","v":""},"A147",{"$f":"SUMIF('1. Costs linked to activities'!B:B,C223,'1. Costs linked to activities'!K:K)","v":0},{"$f":"SUMIF('2. Communication Costs'!B:B,C223,'2. Communication Costs'!K:K)","v":0},{"$f":"SUMIF('3. Travel & Subsistence costs'!B:B,'Breakdown & Project Funding'!C223,'3. Travel & Subsistence costs'!R:R)","v":0},{"$f":"SUMIF('4. Personnel  costs'!B:B,'Breakdown & Project Funding'!C223,'4. Personnel  costs'!W:W)","v":0},null,0]
[null,{"$f":"IF('Action  Plan'!C167=\"\",\"\",'Action  Plan'!C167)","v":""},"A148",{"$f":"SUMIF('1. Costs linked to activities'!B:B,C224,'1. Costs linked to activities'!K:K)","v":0},{"$f":"SUMIF('2. Communication Costs'!B:B,C224,'2. Communication Costs'!K:K)","v":0},{"$f":"SUMIF('3. Travel & Subsistence costs'!B:B,'Breakdown & Project Funding'!C224,'3. Travel & Subsistence costs'!R:R)","v":0},{"$f":"SUMIF('4. Personnel  costs'!B:B,'Breakdown & Project Funding'!C224,'4. Personnel  costs'!W:W)","v":0},null,0]
[null,{"$f":"IF('Action  Plan'!C168=\"\",\"\",'Action  Plan'!C168)","v":""},"A149",{"$f":"SUMIF('1. Costs linked to activities'!B:B,C225,'1. Costs linked to activities'!K:K)","v":0},{"$f":"SUMIF('2. Communication Costs'!B:B,C225,'2. Communication Costs'!K:K)","v":0},{"$f":"SUMIF('3. Travel & Subsistence costs'!B:B,'Breakdown & Project Funding'!C225,'3. Travel & Subsistence costs'!R:R)","v":0},{"$f":"SUMIF('4. Personnel  costs'!B:B,'Breakdown & Project Funding'!C225,'4. Personnel  costs'!W:W)","v":0},null,0]
[null,{"$f":"IF('Action  Plan'!C169=\"\",\"\",'Action  Plan'!C169)","v":""},"A150",{"$f":"SUMIF('1. Costs linked to activities'!B:B,C226,'1. Costs linked to activities'!K:K)","v":0},{"$f":"SUMIF('2. Communication Costs'!B:B,C226,'2. Communication Costs'!K:K)","v":0},{"$f":"SUMIF('3. Travel & Subsistence costs'!B:B,'Breakdown & Project Funding'!C226,'3. Travel & Subsistence costs'!R:R)","v":0},{"$f":"SUMIF('4. Personnel  costs'!B:B,'Breakdown & Project Funding'!C226,'4. Personnel  costs'!W:W)","v":0},null,0]
[null,{"$f":"IF('Action  Plan'!C170=\"\",\"\",'Action  Plan'!C170)","v":""},"A151",{"$f":"SUMIF('1. Costs linked to activities'!B:B,C227,'1. Costs linked to activities'!K:K)","v":0},{"$f":"SUMIF('2. Communication Costs'!B:B,C227,'2. Communication Costs'!K:K)","v":0},{"$f":"SUMIF('3. Travel & Subsistence costs'!B:B,'Breakdown & Project Funding'!C227,'3. Travel & Subsistence costs'!R:R)","v":0},{"$f":"SUMIF('4. Personnel  costs'!B:B,'Breakdown & Project Funding'!C227,'4. Personnel  costs'!W:W)","v":0},null,0]
[null,{"$f":"IF('Action  Plan'!C171=\"\",\"\",'Action  Plan'!C171)","v":""},"A152",{"$f":"SUMIF('1. Costs linked to activities'!B:B,C228,'1. Costs linked to activities'!K:K)","v":0},{"$f":"SUMIF('2. Communication Costs'!B:B,C228,'2. Communication Costs'!K:K)","v":0},{"$f":"SUMIF('3. Travel & Subsistence costs'!B:B,'Breakdown & Project Funding'!C228,'3. Travel & Subsistence costs'!R:R)","v":0},{"$f":"SUMIF('4. Personnel  costs'!B:B,'Breakdown & Project Funding'!C228,'4. Personnel  costs'!W:W)","v":0},null,0]
[null,{"$f":"IF('Action  Plan'!C172=\"\",\"\",'Action  Plan'!C172)","v":""},"A153",{"$f":"SUMIF('1. Costs linked to activities'!B:B,C229,'1. Costs linked to activities'!K:K)","v":0},{"$f":"SUMIF('2. Communication Costs'!B:B,C229,'2. Communication Costs'!K:K)","v":0},{"$f":"SUMIF('3. Travel & Subsistence costs'!B:B,'Breakdown & Project Funding'!C229,'3. Travel & Subsistence costs'!R:R)","v":0},{"$f":"SUMIF('4. Personnel  costs'!B:B,'Breakdown & Project Funding'!C229,'4. Personnel  costs'!W:W)","v":0},null,0]
[null,{"$f":"IF('Action  Plan'!C173=\"\",\"\",'Action  Plan'!C173)","v":""},"A154",{"$f":"SUMIF('1. Costs linked to activities'!B:B,C230,'1. Costs linked to activities'!K:K)","v":0},{"$f":"SUMIF('2. Communication Costs'!B:B,C230,'2. Communication Costs'!K:K)","v":0},{"$f":"SUMIF('3. Travel & Subsistence costs'!B:B,'Breakdown & Project Funding'!C230,'3. Travel & Subsistence costs'!R:R)","v":0},{"$f":"SUMIF('4. Personnel  costs'!B:B,'Breakdown & Project Funding'!C230,'4. Personnel  costs'!W:W)","v":0},null,0]
[null,{"$f":"IF('Action  Plan'!C174=\"\",\"\",'Action  Plan'!C174)","v":""},"A155",{"$f":"SUMIF('1. Costs linked to activities'!B:B,C231,'1. Costs linked to activities'!K:K)","v":0},{"$f":"SUMIF('2. Communication Costs'!B:B,C231,'2. Communication Costs'!K:K)","v":0},{"$f":"SUMIF('3. Travel & Subsistence costs'!B:B,'Breakdown & Project Funding'!C231,'3. Travel & Subsistence costs'!R:R)","v":0},{"$f":"SUMIF('4. Personnel  costs'!B:B,'Breakdown & Project Funding'!C231,'4. Personnel  costs'!W:W)","v":0},null,0]
[null,{"$f":"IF('Action  Plan'!C175=\"\",\"\",'Action  Plan'!C175)","v":""},"A156",{"$f":"SUMIF('1. Costs linked to activities'!B:B,C232,'1. Costs linked to activities'!K:K)","v":0},{"$f":"SUMIF('2. Communication Costs'!B:B,C232,'2. Communication Costs'!K:K)","v":0},{"$f":"SUMIF('3. Travel & Subsistence costs'!B:B,'Breakdown & Project Funding'!C232,'3. Travel & Subsistence costs'!R:R)","v":0},{"$f":"SUMIF('4. Personnel  costs'!B:B,'Breakdown & Project Funding'!C232,'4. Personnel  costs'!W:W)","v":0},null,0]
[null,{"$f":"IF('Action  Plan'!C176=\"\",\"\",'Action  Plan'!C176)","v":""},"A157",{"$f":"SUMIF('1. Costs linked to activities'!B:B,C233,'1. Costs linked to activities'!K:K)","v":0},{"$f":"SUMIF('2. Communication Costs'!B:B,C233,'2. Communication Costs'!K:K)","v":0},{"$f":"SUMIF('3. Travel & Subsistence costs'!B:B,'Breakdown & Project Funding'!C233,'3. Travel & Subsistence costs'!R:R)","v":0},{"$f":"SUMIF('4. Personnel  costs'!B:B,'Breakdown & Project Funding'!C233,'4. Personnel  costs'!W:W)","v":0},null,0]
[null,{"$f":"IF('Action  Plan'!C177=\"\",\"\",'Action  Plan'!C177)","v":""},"A158",{"$f":"SUMIF('1. Costs linked to activities'!B:B,C234,'1. Costs linked to activities'!K:K)","v":0},{"$f":"SUMIF('2. Communication Costs'!B:B,C234,'2. Communication Costs'!K:K)","v":0},{"$f":"SUMIF('3. Travel & Subsistence costs'!B:B,'Breakdown & Project Funding'!C234,'3. Travel & Subsistence costs'!R:R)","v":0},{"$f":"SUMIF('4. Personnel  costs'!B:B,'Breakdown & Project Funding'!C234,'4. Personnel  costs'!W:W)","v":0},null,0]
[null,{"$f":"IF('Action  Plan'!C178=\"\",\"\",'Action  Plan'!C178)","v":""},"A159",{"$f":"SUMIF('1. Costs linked to activities'!B:B,C235,'1. Costs linked to activities'!K:K)","v":0},{"$f":"SUMIF('2. Communication Costs'!B:B,C235,'2. Communication Costs'!K:K)","v":0},{"$f":"SUMIF('3. Travel & Subsistence costs'!B:B,'Breakdown & Project Funding'!C235,'3. Travel & Subsistence costs'!R:R)","v":0},{"$f":"SUMIF('4. Personnel  costs'!B:B,'Breakdown & Project Funding'!C235,'4. Personnel  costs'!W:W)","v":0},null,0]
[null,{"$f":"IF('Action  Plan'!C179=\"\",\"\",'Action  Plan'!C179)","v":""},"A160",{"$f":"SUMIF('1. Costs linked to activities'!B:B,C236,'1. Costs linked to activities'!K:K)","v":0},{"$f":"SUMIF('2. Communication Costs'!B:B,C236,'2. Communication Costs'!K:K)","v":0},{"$f":"SUMIF('3. Travel & Subsistence costs'!B:B,'Breakdown & Project Funding'!C236,'3. Travel & Subsistence costs'!R:R)","v":0},{"$f":"SUMIF('4. Personnel  costs'!B:B,'Breakdown & Project Funding'!C236,'4. Personnel  costs'!W:W)","v":0},null,0]
[null,{"$f":"IF('Action  Plan'!C180=\"\",\"\",'Action  Plan'!C180)","v":""},"A161",{"$f":"SUMIF('1. Costs linked to activities'!B:B,C237,'1. Costs linked to activities'!K:K)","v":0},{"$f":"SUMIF('2. Communication Costs'!B:B,C237,'2. Communication Costs'!K:K)","v":0},{"$f":"SUMIF('3. Travel & Subsistence costs'!B:B,'Breakdown & Project Funding'!C237,'3. Travel & Subsistence costs'!R:R)","v":0},{"$f":"SUMIF('4. Personnel  costs'!B:B,'Breakdown & Project Funding'!C237,'4. Personnel  costs'!W:W)","v":0},null,0]
[null,{"$f":"IF('Action  Plan'!C181=\"\",\"\",'Action  Plan'!C181)","v":""},"A162",{"$f":"SUMIF('1. Costs linked to activities'!B:B,C238,'1. Costs linked to activities'!K:K)","v":0},{"$f":"SUMIF('2. Communication Costs'!B:B,C238,'2. Communication Costs'!K:K)","v":0},{"$f":"SUMIF('3. Travel & Subsistence costs'!B:B,'Breakdown & Project Funding'!C238,'3. Travel & Subsistence costs'!R:R)","v":0},{"$f":"SUMIF('4. Personnel  costs'!B:B,'Breakdown & Project Funding'!C238,'4. Personnel  costs'!W:W)","v":0},null,0]
[null,{"$f":"IF('Action  Plan'!C182=\"\",\"\",'Action  Plan'!C182)","v":""},"A163",{"$f":"SUMIF('1. Costs linked to activities'!B:B,C239,'1. Costs linked to activities'!K:K)","v":0},{"$f":"SUMIF('2. Communication Costs'!B:B,C239,'2. Communication Costs'!K:K)","v":0},{"$f":"SUMIF('3. Travel & Subsistence costs'!B:B,'Breakdown & Project Funding'!C239,'3. Travel & Subsistence costs'!R:R)","v":0},{"$f":"SUMIF('4. Personnel  costs'!B:B,'Breakdown & Project Funding'!C239,'4. Personnel  costs'!W:W)","v":0},null,0]
[null,{"$f":"IF('Action  Plan'!C183=\"\",\"\",'Action  Plan'!C183)","v":""},"A164",{"$f":"SUMIF('1. Costs linked to activities'!B:B,C240,'1. Costs linked to activities'!K:K)","v":0},{"$f":"SUMIF('2. Communication Costs'!B:B,C240,'2. Communication Costs'!K:K)","v":0},{"$f":"SUMIF('3. Travel & Subsistence costs'!B:B,'Breakdown & Project Funding'!C240,'3. Travel & Subsistence costs'!R:R)","v":0},{"$f":"SUMIF('4. Personnel  costs'!B:B,'Breakdown & Project Funding'!C240,'4. Personnel  costs'!W:W)","v":0},null,0]
[null,{"$f":"IF('Action  Plan'!C184=\"\",\"\",'Action  Plan'!C184)","v":""},"A165",{"$f":"SUMIF('1. Costs linked to activities'!B:B,C241,'1. Costs linked to activities'!K:K)","v":0},{"$f":"SUMIF('2. Communication Costs'!B:B,C241,'2. Communication Costs'!K:K)","v":0},{"$f":"SUMIF('3. Travel & Subsistence costs'!B:B,'Breakdown & Project Funding'!C241,'3. Travel & Subsistence costs'!R:R)","v":0},{"$f":"SUMIF('4. Personnel  costs'!B:B,'Breakdown & Project Funding'!C241,'4. Personnel  costs'!W:W)","v":0},null,0]
[null,{"$f":"IF('Action  Plan'!C185=\"\",\"\",'Action  Plan'!C185)","v":""},"A166",{"$f":"SUMIF('1. Costs linked to activities'!B:B,C242,'1. Costs linked to activities'!K:K)","v":0},{"$f":"SUMIF('2. Communication Costs'!B:B,C242,'2. Communication Costs'!K:K)","v":0},{"$f":"SUMIF('3. Travel & Subsistence costs'!B:B,'Breakdown & Project Funding'!C242,'3. Travel & Subsistence costs'!R:R)","v":0},{"$f":"SUMIF('4. Personnel  costs'!B:B,'Breakdown & Project Funding'!C242,'4. Personnel  costs'!W:W)","v":0},null,0]
[null,{"$f":"IF('Action  Plan'!C186=\"\",\"\",'Action  Plan'!C186)","v":""},"A167",{"$f":"SUMIF('1. Costs linked to activities'!B:B,C243,'1. Costs linked to activities'!K:K)","v":0},{"$f":"SUMIF('2. Communication Costs'!B:B,C243,'2. Communication Costs'!K:K)","v":0},{"$f":"SUMIF('3. Travel & Subsistence costs'!B:B,'Breakdown & Project Funding'!C243,'3. Travel & Subsistence costs'!R:R)","v":0},{"$f":"SUMIF('4. Personnel  costs'!B:B,'Breakdown & Project Funding'!C243,'4. Personnel  costs'!W:W)","v":0},null,0]
[null,{"$f":"IF('Action  Plan'!C187=\"\",\"\",'Action  Plan'!C187)","v":""},"A168",{"$f":"SUMIF('1. Costs linked to activities'!B:B,C244,'1. Costs linked to activities'!K:K)","v":0},{"$f":"SUMIF('2. Communication Costs'!B:B,C244,'2. Communication Costs'!K:K)","v":0},{"$f":"SUMIF('3. Travel & Subsistence costs'!B:B,'Breakdown & Project Funding'!C244,'3. Travel & Subsistence costs'!R:R)","v":0},{"$f":"SUMIF('4. Personnel  costs'!B:B,'Breakdown & Project Funding'!C244,'4. Personnel  costs'!W:W)","v":0},null,0]
[null,{"$f":"IF('Action  Plan'!C188=\"\",\"\",'Action  Plan'!C188)","v":""},"A169",{"$f":"SUMIF('1. Costs linked to activities'!B:B,C245,'1. Costs linked to activities'!K:K)","v":0},{"$f":"SUMIF('2. Communication Costs'!B:B,C245,'2. Communication Costs'!K:K)","v":0},{"$f":"SUMIF('3. Travel & Subsistence costs'!B:B,'Breakdown & Project Funding'!C245,'3. Travel & Subsistence costs'!R:R)","v":0},{"$f":"SUMIF('4. Personnel  costs'!B:B,'Breakdown & Project Funding'!C245,'4. Personnel  costs'!W:W)","v":0},null,0]
[null,{"$f":"IF('Action  Plan'!C189=\"\",\"\",'Action  Plan'!C189)","v":""},"A170",{"$f":"SUMIF('1. Costs linked to activities'!B:B,C246,'1. Costs linked to activities'!K:K)","v":0},{"$f":"SUMIF('2. Communication Costs'!B:B,C246,'2. Communication Costs'!K:K)","v":0},{"$f":"SUMIF('3. Travel & Subsistence costs'!B:B,'Breakdown & Project Funding'!C246,'3. Travel & Subsistence costs'!R:R)","v":0},{"$f":"SUMIF('4. Personnel  costs'!B:B,'Breakdown & Project Funding'!C246,'4. Personnel  costs'!W:W)","v":0},null,0]
[null,{"$f":"IF('Action  Plan'!C190=\"\",\"\",'Action  Plan'!C190)","v":""},"A171",{"$f":"SUMIF('1. Costs linked to activities'!B:B,C247,'1. Costs linked to activities'!K:K)","v":0},{"$f":"SUMIF('2. Communication Costs'!B:B,C247,'2. Communication Costs'!K:K)","v":0},{"$f":"SUMIF('3. Travel & Subsistence costs'!B:B,'Breakdown & Project Funding'!C247,'3. Travel & Subsistence costs'!R:R)","v":0},{"$f":"SUMIF('4. Personnel  costs'!B:B,'Breakdown & Project Funding'!C247,'4. Personnel  costs'!W:W)","v":0},null,0]
[null,{"$f":"IF('Action  Plan'!C191=\"\",\"\",'Action  Plan'!C191)","v":""},"A172",{"$f":"SUMIF('1. Costs linked to activities'!B:B,C248,'1. Costs linked to activities'!K:K)","v":0},{"$f":"SUMIF('2. Communication Costs'!B:B,C248,'2. Communication Costs'!K:K)","v":0},{"$f":"SUMIF('3. Travel & Subsistence costs'!B:B,'Breakdown & Project Funding'!C248,'3. Travel & Subsistence costs'!R:R)","v":0},{"$f":"SUMIF('4. Personnel  costs'!B:B,'Breakdown & Project Funding'!C248,'4. Personnel  costs'!W:W)","v":0},null,0]
[null,{"$f":"IF('Action  Plan'!C192=\"\",\"\",'Action  Plan'!C192)","v":""},"A173",{"$f":"SUMIF('1. Costs linked to activities'!B:B,C249,'1. Costs linked to activities'!K:K)","v":0},{"$f":"SUMIF('2. Communication Costs'!B:B,C249,'2. Communication Costs'!K:K)","v":0},{"$f":"SUMIF('3. Travel & Subsistence costs'!B:B,'Breakdown & Project Funding'!C249,'3. Travel & Subsistence costs'!R:R)","v":0},{"$f":"SUMIF('4. Personnel  costs'!B:B,'Breakdown & Project Funding'!C249,'4. Personnel  costs'!W:W)","v":0},null,0]
[null,{"$f":"IF('Action  Plan'!C193=\"\",\"\",'Action  Plan'!C193)","v":""},"A174",{"$f":"SUMIF('1. Costs linked to activities'!B:B,C250,'1. Costs linked to activities'!K:K)","v":0},{"$f":"SUMIF('2. Communication Costs'!B:B,C250,'2. Communication Costs'!K:K)","v":0},{"$f":"SUMIF('3. Travel & Subsistence costs'!B:B,'Breakdown & Project Funding'!C250,'3. Travel & Subsistence costs'!R:R)","v":0},{"$f":"SUMIF('4. Personnel  costs'!B:B,'Breakdown & Project Funding'!C250,'4. Personnel  costs'!W:W)","v":0},null,0]
[null,{"$f":"IF('Action  Plan'!C194=\"\",\"\",'Action  Plan'!C194)","v":""},"A175",{"$f":"SUMIF('1. Costs linked to activities'!B:B,C251,'1. Costs linked to activities'!K:K)","v":0},{"$f":"SUMIF('2. Communication Costs'!B:B,C251,'2. Communication Costs'!K:K)","v":0},{"$f":"SUMIF('3. Travel & Subsistence costs'!B:B,'Breakdown & Project Funding'!C251,'3. Travel & Subsistence costs'!R:R)","v":0},{"$f":"SUMIF('4. Personnel  costs'!B:B,'Breakdown & Project Funding'!C251,'4. Personnel  costs'!W:W)","v":0},null,0]
[null,{"$f":"IF('Action  Plan'!C195=\"\",\"\",'Action  Plan'!C195)","v":""},"A176",{"$f":"SUMIF('1. Costs linked to activities'!B:B,C252,'1. Costs linked to activities'!K:K)","v":0},{"$f":"SUMIF('2. Communication Costs'!B:B,C252,'2. Communication Costs'!K:K)","v":0},{"$f":"SUMIF('3. Travel & Subsistence costs'!B:B,'Breakdown & Project Funding'!C252,'3. Travel & Subsistence costs'!R:R)","v":0},{"$f":"SUMIF('4. Personnel  costs'!B:B,'Breakdown & Project Funding'!C252,'4. Personnel  costs'!W:W)","v":0},null,0]
[null,{"$f":"IF('Action  Plan'!C196=\"\",\"\",'Action  Plan'!C196)","v":""},"A177",{"$f":"SUMIF('1. Costs linked to activities'!B:B,C253,'1. Costs linked to activities'!K:K)","v":0},{"$f":"SUMIF('2. Communication Costs'!B:B,C253,'2. Communication Costs'!K:K)","v":0},{"$f":"SUMIF('3. Travel & Subsistence costs'!B:B,'Breakdown & Project Funding'!C253,'3. Travel & Subsistence costs'!R:R)","v":0},{"$f":"SUMIF('4. Personnel  costs'!B:B,'Breakdown & Project Funding'!C253,'4. Personnel  costs'!W:W)","v":0},null,0]
[null,{"$f":"IF('Action  Plan'!C197=\"\",\"\",'Action  Plan'!C197)","v":""},"A178",{"$f":"SUMIF('1. Costs linked to activities'!B:B,C254,'1. Costs linked to activities'!K:K)","v":0},{"$f":"SUMIF('2. Communication Costs'!B:B,C254,'2. Communication Costs'!K:K)","v":0},{"$f":"SUMIF('3. Travel & Subsistence costs'!B:B,'Breakdown & Project Funding'!C254,'3. Travel & Subsistence costs'!R:R)","v":0},{"$f":"SUMIF('4. Personnel  costs'!B:B,'Breakdown & Project Funding'!C254,'4. Personnel  costs'!W:W)","v":0},null,0]
[null,{"$f":"IF('Action  Plan'!C198=\"\",\"\",'Action  Plan'!C198)","v":""},"A179",{"$f":"SUMIF('1. Costs linked to activities'!B:B,C255,'1. Costs linked to activities'!K:K)","v":0},{"$f":"SUMIF('2. Communication Costs'!B:B,C255,'2. Communication Costs'!K:K)","v":0},{"$f":"SUMIF('3. Travel & Subsistence costs'!B:B,'Breakdown & Project Funding'!C255,'3. Travel & Subsistence costs'!R:R)","v":0},{"$f":"SUMIF('4. Personnel  costs'!B:B,'Breakdown & Project Funding'!C255,'4. Personnel  costs'!W:W)","v":0},null,0]
[null,{"$f":"IF('Action  Plan'!C199=\"\",\"\",'Action  Plan'!C199)","v":""},"A180",{"$f":"SUMIF('1. Costs linked to activities'!B:B,C256,'1. Costs linked to activities'!K:K)","v":0},{"$f":"SUMIF('2. Communication Costs'!B:B,C256,'2. Communication Costs'!K:K)","v":0},{"$f":"SUMIF('3. Travel & Subsistence costs'!B:B,'Breakdown & Project Funding'!C256,'3. Travel & Subsistence costs'!R:R)","v":0},{"$f":"SUMIF('4. Personnel  costs'!B:B,'Breakdown & Project Funding'!C256,'4. Personnel  costs'!W:W)","v":0},null,0]
[null,{"$f":"IF('Action  Plan'!C200=\"\",\"\",'Action  Plan'!C200)","v":""},"A181",{"$f":"SUMIF('1. Costs linked to activities'!B:B,C257,'1. Costs linked to activities'!K:K)","v":0},{"$f":"SUMIF('2. Communication Costs'!B:B,C257,'2. Communication Costs'!K:K)","v":0},{"$f":"SUMIF('3. Travel & Subsistence costs'!B:B,'Breakdown & Project Funding'!C257,'3. Travel & Subsistence costs'!R:R)","v":0},{"$f":"SUMIF('4. Personnel  costs'!B:B,'Breakdown & Project Funding'!C257,'4. Personnel  costs'!W:W)","v":0},null,0]
[null,{"$f":"IF('Action  Plan'!C201=\"\",\"\",'Action  Plan'!C201)","v":""},"A182",{"$f":"SUMIF('1. Costs linked to activities'!B:B,C258,'1. Costs linked to activities'!K:K)","v":0},{"$f":"SUMIF('2. Communication Costs'!B:B,C258,'2. Communication Costs'!K:K)","v":0},{"$f":"SUMIF('3. Travel & Subsistence costs'!B:B,'Breakdown & Project Funding'!C258,'3. Travel & Subsistence costs'!R:R)","v":0},{"$f":"SUMIF('4. Personnel  costs'!B:B,'Breakdown & Project Funding'!C258,'4. Personnel  costs'!W:W)","v":0},null,0]
[null,{"$f":"IF('Action  Plan'!C202=\"\",\"\",'Action  Plan'!C202)","v":""},"A183",{"$f":"SUMIF('1. Costs linked to activities'!B:B,C259,'1. Costs linked to activities'!K:K)","v":0},{"$f":"SUMIF('2. Communication Costs'!B:B,C259,'2. Communication Costs'!K:K)","v":0},{"$f":"SUMIF('3. Travel & Subsistence costs'!B:B,'Breakdown & Project Funding'!C259,'3. Travel & Subsistence costs'!R:R)","v":0},{"$f":"SUMIF('4. Personnel  costs'!B:B,'Breakdown & Project Funding'!C259,'4. Personnel  costs'!W:W)","v":0},null,0]
[null,{"$f":"IF('Action  Plan'!C203=\"\",\"\",'Action  Plan'!C203)","v":""},"A184",{"$f":"SUMIF('1. Costs linked to activities'!B:B,C260,'1. Costs linked to activities'!K:K)","v":0},{"$f":"SUMIF('2. Communication Costs'!B:B,C260,'2. Communication Costs'!K:K)","v":0},{"$f":"SUMIF('3. Travel & Subsistence costs'!B:B,'Breakdown & Project Funding'!C260,'3. Travel & Subsistence costs'!R:R)","v":0},{"$f":"SUMIF('4. Personnel  costs'!B:B,'Breakdown & Project Funding'!C260,'4. Personnel  costs'!W:W)","v":0},null,0]
[null,{"$f":"IF('Action  Plan'!C204=\"\",\"\",'Action  Plan'!C204)","v":""},"A185",{"$f":"SUMIF('1. Costs linked to activities'!B:B,C261,'1. Costs linked to activities'!K:K)","v":0},{"$f":"SUMIF('2. Communication Costs'!B:B,C261,'2. Communication Costs'!K:K)","v":0},{"$f":"SUMIF('3. Travel & Subsistence costs'!B:B,'Breakdown & Project Funding'!C261,'3. Travel & Subsistence costs'!R:R)","v":0},{"$f":"SUMIF('4. Personnel  costs'!B:B,'Breakdown & Project Funding'!C261,'4. Personnel  costs'!W:W)","v":0},null,0]
[null,{"$f":"IF('Action  Plan'!C205=\"\",\"\",'Action  Plan'!C205)","v":""},"A186",{"$f":"SUMIF('1. Costs linked to activities'!B:B,C262,'1. Costs linked to activities'!K:K)","v":0},{"$f":"SUMIF('2. Communication Costs'!B:B,C262,'2. Communication Costs'!K:K)","v":0},{"$f":"SUMIF('3. Travel & Subsistence costs'!B:B,'Breakdown & Project Funding'!C262,'3. Travel & Subsistence costs'!R:R)","v":0},{"$f":"SUMIF('4. Personnel  costs'!B:B,'Breakdown & Project Funding'!C262,'4. Personnel  costs'!W:W)","v":0},null,0]
[null,{"$f":"IF('Action  Plan'!C206=\"\",\"\",'Action  Plan'!C206)","v":""},"A187",{"$f":"SUMIF('1. Costs linked to activities'!B:B,C263,'1. Costs linked to activities'!K:K)","v":0},{"$f":"SUMIF('2. Communication Costs'!B:B,C263,'2. Communication Costs'!K:K)","v":0},{"$f":"SUMIF('3. Travel & Subsistence costs'!B:B,'Breakdown & Project Funding'!C263,'3. Travel & Subsistence costs'!R:R)","v":0},{"$f":"SUMIF('4. Personnel  costs'!B:B,'Breakdown & Project Funding'!C263,'4. Personnel  costs'!W:W)","v":0},null,0]
[null,{"$f":"IF('Action  Plan'!C207=\"\",\"\",'Action  Plan'!C207)","v":""},"A188",{"$f":"SUMIF('1. Costs linked to activities'!B:B,C264,'1. Costs linked to activities'!K:K)","v":0},{"$f":"SUMIF('2. Communication Costs'!B:B,C264,'2. Communication Costs'!K:K)","v":0},{"$f":"SUMIF('3. Travel & Subsistence costs'!B:B,'Breakdown & Project Funding'!C264,'3. Travel & Subsistence costs'!R:R)","v":0},{"$f":"SUMIF('4. Personnel  costs'!B:B,'Breakdown & Project Funding'!C264,'4. Personnel  costs'!W:W)","v":0},null,0]
[null,{"$f":"IF('Action  Plan'!C208=\"\",\"\",'Action  Plan'!C208)","v":""},"A189",{"$f":"SUMIF('1. Costs linked to activities'!B:B,C265,'1. Costs linked to activities'!K:K)","v":0},{"$f":"SUMIF('2. Communication Costs'!B:B,C265,'2. Communication Costs'!K:K)","v":0},{"$f":"SUMIF('3. Travel & Subsistence costs'!B:B,'Breakdown & Project Funding'!C265,'3. Travel & Subsistence costs'!R:R)","v":0},{"$f":"SUMIF('4. Personnel  costs'!B:B,'Breakdown & Project Funding'!C265,'4. Personnel  costs'!W:W)","v":0},null,0]
[null,{"$f":"IF('Action  Plan'!C209=\"\",\"\",'Action  Plan'!C209)","v":""},"A190",{"$f":"SUMIF('1. Costs linked to activities'!B:B,C266,'1. Costs linked to activities'!K:K)","v":0},{"$f":"SUMIF('2. Communication Costs'!B:B,C266,'2. Communication Costs'!K:K)","v":0},{"$f":"SUMIF('3. Travel & Subsistence costs'!B:B,'Breakdown & Project Funding'!C266,'3. Travel & Subsistence costs'!R:R)","v":0},{"$f":"SUMIF('4. Personnel  costs'!B:B,'Breakdown & Project Funding'!C266,'4. Personnel  costs'!W:W)","v":0},null,0]
[null,{"$f":"IF('Action  Plan'!C210=\"\",\"\",'Action  Plan'!C210)","v":""},"A191",{"$f":"SUMIF('1. Costs linked to activities'!B:B,C267,'1. Costs linked to activities'!K:K)","v":0},{"$f":"SUMIF('2. Communication Costs'!B:B,C267,'2. Communication Costs'!K:K)","v":0},{"$f":"SUMIF('3. Travel & Subsistence costs'!B:B,'Breakdown & Project Funding'!C267,'3. Travel & Subsistence costs'!R:R)","v":0},{"$f":"SUMIF('4. Personnel  costs'!B:B,'Breakdown & Project Funding'!C267,'4. Personnel  costs'!W:W)","v":0},null,0]
[null,{"$f":"IF('Action  Plan'!C211=\"\",\"\",'Action  Plan'!C211)","v":""},"A192",{"$f":"SUMIF('1. Costs linked to activities'!B:B,C268,'1. Costs linked to activities'!K:K)","v":0},{"$f":"SUMIF('2. Communication Costs'!B:B,C268,'2. Communication Costs'!K:K)","v":0},{"$f":"SUMIF('3. Travel & Subsistence costs'!B:B,'Breakdown & Project Funding'!C268,'3. Travel & Subsistence costs'!R:R)","v":0},{"$f":"SUMIF('4. Personnel  costs'!B:B,'Breakdown & Project Funding'!C268,'4. Personnel  costs'!W:W)","v":0},null,0]
[null,{"$f":"IF('Action  Plan'!C212=\"\",\"\",'Action  Plan'!C212)","v":""},"A193",{"$f":"SUMIF('1. Costs linked to activities'!B:B,C269,'1. Costs linked to activities'!K:K)","v":0},{"$f":"SUMIF('2. Communication Costs'!B:B,C269,'2. Communication Costs'!K:K)","v":0},{"$f":"SUMIF('3. Travel & Subsistence costs'!B:B,'Breakdown & Project Funding'!C269,'3. Travel & Subsistence costs'!R:R)","v":0},{"$f":"SUMIF('4. Personnel  costs'!B:B,'Breakdown & Project Funding'!C269,'4. Personnel  costs'!W:W)","v":0},null,0]
[null,{"$f":"IF('Action  Plan'!C213=\"\",\"\",'Action  Plan'!C213)","v":""},"A194",{"$f":"SUMIF('1. Costs linked to activities'!B:B,C270,'1. Costs linked to activities'!K:K)","v":0},{"$f":"SUMIF('2. Communication Costs'!B:B,C270,'2. Communication Costs'!K:K)","v":0},{"$f":"SUMIF('3. Travel & Subsistence costs'!B:B,'Breakdown & Project Funding'!C270,'3. Travel & Subsistence costs'!R:R)","v":0},{"$f":"SUMIF('4. Personnel  costs'!B:B,'Breakdown & Project Funding'!C270,'4. Personnel  costs'!W:W)","v":0},null,{"$f":"SUM(D270:H270)","v":0}]
[null,{"$f":"IF('Action  Plan'!C214=\"\",\"\",'Action  Plan'!C214)","v":""},"A195",{"$f":"SUMIF('1. Costs linked to activities'!B:B,C271,'1. Costs linked to activities'!K:K)","v":0},{"$f":"SUMIF('2. Communication Costs'!B:B,C271,'2. Communication Costs'!K:K)","v":0},{"$f":"SUMIF('3. Travel & Subsistence costs'!B:B,'Breakdown & Project Funding'!C271,'3. Travel & Subsistence costs'!R:R)","v":0},{"$f":"SUMIF('4. Personnel  costs'!B:B,'Breakdown & Project Funding'!C271,'4. Personnel  costs'!W:W)","v":0},null,0]
[null,{"$f":"IF('Action  Plan'!C215=\"\",\"\",'Action  Plan'!C215)","v":""},"A196",{"$f":"SUMIF('1. Costs linked to activities'!B:B,C272,'1. Costs linked to activities'!K:K)","v":0},{"$f":"SUMIF('2. Communication Costs'!B:B,C272,'2. Communication Costs'!K:K)","v":0},{"$f":"SUMIF('3. Travel & Subsistence costs'!B:B,'Breakdown & Project Funding'!C272,'3. Travel & Subsistence costs'!R:R)","v":0},{"$f":"SUMIF('4. Personnel  costs'!B:B,'Breakdown & Project Funding'!C272,'4. Personnel  costs'!W:W)","v":0},null,0]
[null,{"$f":"IF('Action  Plan'!C216=\"\",\"\",'Action  Plan'!C216)","v":""},"A197",{"$f":"SUMIF('1. Costs linked to activities'!B:B,C273,'1. Costs linked to activities'!K:K)","v":0},{"$f":"SUMIF('2. Communication Costs'!B:B,C273,'2. Communication Costs'!K:K)","v":0},{"$f":"SUMIF('3. Travel & Subsistence costs'!B:B,'Breakdown & Project Funding'!C273,'3. Travel & Subsistence costs'!R:R)","v":0},{"$f":"SUMIF('4. Personnel  costs'!B:B,'Breakdown & Project Funding'!C273,'4. Personnel  costs'!W:W)","v":0},null,0]
[null,{"$f":"IF('Action  Plan'!C217=\"\",\"\",'Action  Plan'!C217)","v":""},"A198",{"$f":"SUMIF('1. Costs linked to activities'!B:B,C274,'1. Costs linked to activities'!K:K)","v":0},{"$f":"SUMIF('2. Communication Costs'!B:B,C274,'2. Communication Costs'!K:K)","v":0},{"$f":"SUMIF('3. Travel & Subsistence costs'!B:B,'Breakdown & Project Funding'!C274,'3. Travel & Subsistence costs'!R:R)","v":0},{"$f":"SUMIF('4. Personnel  costs'!B:B,'Breakdown & Project Funding'!C274,'4. Personnel  costs'!W:W)","v":0},null,0]
[null,{"$f":"IF('Action  Plan'!C218=\"\",\"\",'Action  Plan'!C218)","v":""},"A199",{"$f":"SUMIF('1. Costs linked to activities'!B:B,C275,'1. Costs linked to activities'!K:K)","v":0},{"$f":"SUMIF('2. Communication Costs'!B:B,C275,'2. Communication Costs'!K:K)","v":0},{"$f":"SUMIF('3. Travel & Subsistence costs'!B:B,'Breakdown & Project Funding'!C275,'3. Travel & Subsistence costs'!R:R)","v":0},{"$f":"SUMIF('4. Personnel  costs'!B:B,'Breakdown & Project Funding'!C275,'4. Personnel  costs'!W:W)","v":0},null,0]
[null,{"$f":"IF('Action  Plan'!C219=\"\",\"\",'Action  Plan'!C219)","v":""},"A200",{"$f":"SUMIF('1. Costs linked to activities'!B:B,C276,'1. Costs linked to activities'!K:K)","v":0},{"$f":"SUMIF('2. Communication Costs'!B:B,C276,'2. Communication Costs'!K:K)","v":0},{"$f":"SUMIF('3. Travel & Subsistence costs'!B:B,'Breakdown & Project Funding'!C276,'3. Travel & Subsistence costs'!R:R)","v":0},{"$f":"SUMIF('4. Personnel  costs'!B:B,'Breakdown & Project Funding'!C276,'4. Personnel  costs'!W:W)","v":0},null,0]

{"sheet":"Data sources","index":9,"n_rows":193,"n_cols":12,"rows_kept":193,"cut":false,"hidden":true,"merged":[[24,1,24,6],[25,1,25,6],[14,1,14,6],[15,1,15,6],[2,1,2,6],[46,1,46,6],[29,1,29,6],[30,1,30,6],[31,1,31,6],[37,1,37,6],[69,2,70,6],[55,1,55,6],[56,1,56,6],[57,1,57,6],[58,1,58,6],[59,1,59,6],[60,1,60,6],[61,1,61,6],[62,1,62,6],[63,1,63,6],[64,1,64,6],[67,1,67,6]]}
[]
[]
[null,"COSTS DIRECTLY LINKED TO THE IMPLEMENTATION OF PROJECT ACTIVITIES",null,null,null,null,null,null,"Work packages",null,null,"List of income"]
[null,"Purchase of rights",null,null,null,null,null,null,"Preparatory Phase",null,null,"Distribution of the EU grant requested between partners"]
[null,"Premises costs",null,null,null,null,null,null,"Management",null,null,"Income generated by the project"]
[null,"Equipment costs",null,null,null,null,null,null,"Communication and Dissemination",null,null,"Self-financing in own and raised funds"]
[null,"Purchase of materials",null,null,null,null,null,null,"Evaluation and Quality Assessment",null,null,"Contributions from private sources"]
[null,"Purchase of equipment (depreciation only)",null,null,null,null,null,null,"Implementation (cultural activities, publication, studies, research, etc.)",null,null,"Contributions from public sources"]
[null,"Transport of equipment"]
[null,"Insurance ",null,null,null,null,null,null,"Country"]
[null,"Scenography",null,null,null,null,null,null,"Austria"]
[null,"Catering",null,null,null,null,null,null,"Belgium",null,null,"Priorities for Cooperation Projects 2019"]
[null,"Financial support to third parties = Prizes and/or Bursaries (please specify)",null,null,null,null,null,null,"Bulgaria",null,null,"A. transnational mobility"]
[null,"Other (please specify)",null,null,null,null,null,null,"Croatia",null,null,"B. audience development"]
[null,null,null,null,null,null,null,null,"Cyprus",null,null,"C.1. capacity building – digitisation"]
[null,"COMMUNICATION, PROMOTION AND DISSEMINATION COSTS AND COSTS OF EXPLOITATION OF RESULTS",null,null,null,null,null,null,"Czech Republic",null,null,"C.2. capacity building - new business models"]
[null,"Production costs (printing costs)",null,null,null,null,null,null,"Denmark",null,null,"C.3 capacity building - education and training."]
[null,"Advertising space (publicity TV, radio, press conference, social networks, etc.)",null,null,null,null,null,null,"Estonia",null,null,"D. intercultural dialogue and social integration of migrants and refugees"]
[null,"Purchase of materials  (T-shirts, flyers, papers, posters, etc. )",null,null,null,null,null,null,"Finland",null,null,"E. legacy of the European Year of Cultural Heritage 2018"]
[null,"Other Advertising costs (please specify)",null,null,null,null,null,null,"former Yugoslav Republic of Macedonia"]
[null,"Costs for the update or creation of the web site (no staff costs allowed)",null,null,null,null,null,null,"France",null,null,"Person travelling"]
[null,"Other web costs (please specify)",null,null,null,null,null,null,"Germany",null,null,"Staff member(s)"]
[null,"Documentation costs (professional magazines, newspaper, books etc.)",null,null,null,null,null,null,"Greece",null,null,"External professional services "]
[null,"Distribution costs (mail, postage, packaging, etc.)",null,null,null,null,null,null,"Hungary",null,null,"Artists, scientific personnel,  technicians"]
[null,null,null,null,null,null,null,null,"Iceland"]
[null,"TRAVEL & SUBSISTENCE COSTS",null,null,null,null,null,null,"Ireland",null,null,"EU grant"]
[null,"Transport (including local transport)",null,null,null,null,null,null,"Italy",null,null,"As per Guidelines: max. 60% and max. 200.000,00 € for category 1 - Smaller scale cooperation projects "]
[null,"Accommodation costs",null,null,null,null,null,null,"Latvia",null,null,"As per Guidelines: max. 50% and max. 2.000.000,00 € for category 2  - Larger scale cooperation projects"]
[null,"Subsistence costs",null,null,null,null,null,null,"Liechtenstein",null,null,"Category 1 - Smaller scale"]
[null,null,null,null,null,null,null,null,"Lithuania",null,null,"Category 2 - Larger scale"]
[null,"PERSONNEL COSTS",null,null,null,null,null,null,"Luxembourg"]
[null,"Salaries (incl. labour costs and social security charges) of personnel and fees for project management",null,null,null,null,null,null,"Malta",null,null,"Partner"]
[null,"Project manager/officer",null,null,null,null,null,null,"Netherlands",null,null,"Number of participants"]
[null,"Assistant",null,null,null,null,null,null,"Norway",null,null,"Visitors"]
[null,"Secretary",null,null,null,null,null,null,"Poland",null,null,"Audience"]
[null,"Other salaries and fees (please specify)",null,null,null,null,null,null,"Portugal",null,null,"Target groups"]
[null,"n/a",null,null,null,null,null,null,"Romania"]
[null,"External professional services ",null,null,null,null,null,null,"Slovakia"]
[null,"Lawyers",null,null,null,null,null,null,"Slovenia"]
[null,"Accountant",null,null,null,null,null,null,"Spain"]
[null,"Auditor (linked to the final report and only for the project leader)",null,null,null,null,null,null,"Sweden"]
[null,"IT maintenance/Helpdesk",null,null,null,null,null,null,"Turkey"]
[null,"Interpreters and translators",null,null,null,null,null,null,"United Kingdom"]
[null,"External speakers",null,null,null,null,null,null,"Afghanistan"]
[null,"Other external professional services (please specify)",null,null,null,null,null,null,"Albania"]
[null,"n/a",null,null,null,null,null,null,"Algeria"]
[null,"Fees, remuneration of artists, scientific personnel and technicians",null,null,null,null,null,null,"Angola"]
[null,"Artistic director",null,null,null,null,null,null,"Antigua and Barbuda"]
[null,"Artist fees",null,null,null,null,null,null,"Argentina"]
[null,"Scientific personnel",null,null,null,null,null,null,"Armenia"]
[null,"Technicians",null,null,null,null,null,null,"Azerbaijan"]
[null,"Web master",null,null,null,null,null,null,"Bahamas"]
[null,"Production (design & layout)",null,null,null,null,null,null,"Bangladesh"]
[null,"Others: reception staff, security, etc (please specify) ",null,null,null,null,null,null,"Barbados"]
[null,"n/a",null,null,null,null,null,null,"Belarus"]
[null,"TOTAL DIRECT COSTS ",null,null,null,null,null,null,"Belize"]
[null,null,null,null,null,null,null,null,"Benin"]
[null,"INDIRECT COSTS (MAX. 7% OF THE DIRECT COSTS)",null,null,null,null,null,null,"Bhutan"]
[null,null,null,null,null,null,null,null,"Bolivia"]
[null,"Premises and related expenses (e.g. office rent, insurance, electricity, water, cleaning, …) and office expenses and consumables (e.g. telephone/fax/internet, postage and mailing, photocopies, depreciation of equipment, …)",null,null,null,null,null,null,"Bosnia and Herzegovina"]
[null,"Maximum 7% of the total direct costs = ",null,null,null,null,null,null,"Botswana"]
[null,null,null,null,null,null,null,null,"Brazil"]
[null,"TOTAL COSTS ",null,null,null,null,null,null,"Burkina Faso"]
[null,null,null,null,null,null,null,null,"Burundi"]
[null,"TOTAL COSTS INCURRED IN OR IN RELATION TO A THIRD COUNTRY",null,null,null,null,null,null,"Cambodia"]
[null,null,null,null,null,null,null,null,"Cameroon"]
[null,null,null,null,null,null,null,null,"Canada"]
[null,null,null,null,null,null,null,null,"Cape Verde"]
[null,null,null,null,null,null,null,null,"Central African Republic"]
[null,null,null,null,null,null,null,null,"Chad"]
[null,null,null,null,null,null,null,null,"Chile"]
[null,null,null,null,null,null,null,null,"China"]
[null,null,null,null,null,null,null,null,"Colombia"]
[null,null,null,null,null,null,null,null,"Comoros"]
[null,null,null,null,null,null,null,null,"Congo"]
[null,null,null,null,null,null,null,null,"Congo - Republic of the-"]
[null,null,null,null,null,null,null,null,"Cook Islands"]
[null,null,null,null,null,null,null,null,"Costa Rica"]
[null,null,null,null,null,null,null,null,"Cuba"]
[null,null,null,null,null,null,null,null,"Djibouti"]
[null,null,null,null,null,null,null,null,"Dominica"]
[null,null,null,null,null,null,null,null,"Dominican Republic"]
[null,null,null,null,null,null,null,null,"DPR Korea"]
[null,null,null,null,null,null,null,null,"Ecuador"]
[null,null,null,null,null,null,null,null,"Egypt"]
[null,null,null,null,null,null,null,null,"El Salvador"]
[null,null,null,null,null,null,null,null,"Equatorial Guinea"]
[null,null,null,null,null,null,null,null,"Eritrea"]
[null,null,null,null,null,null,null,null,"Ethiopia"]
[null,null,null,null,null,null,null,null,"Fiji"]
[null,null,null,null,null,null,null,null,"Gabon"]
[null,null,null,null,null,null,null,null,"Gambia"]
[null,null,null,null,null,null,null,null,"Georgia"]
[null,null,null,null,null,null,null,null,"Ghana"]
[null,null,null,null,null,null,null,null,"Grenada"]
[null,null,null,null,null,null,null,null,"Guatemala"]
[null,null,null,null,null,null,null,null,"Guinea"]
[null,null,null,null,null,null,null,null,"Guinea-Bissau"]
[null,null,null,null,null,null,null,null,"Guyana"]
[null,null,null,null,null,null,null,null,"Haiti"]
[null,null,null,null,null,null,null,null,"Honduras"]
[null,null,null,null,null,null,null,null,"India"]
[null,null,null,null,null,null,null,null,"Indonesia"]
[null,null,null,null,null,null,null,null,"Iran"]
[null,null,null,null,null,null,null,null,"Iraq"]
[null,null,null,null,null,null,null,null,"Israel"]
[null,null,null,null,null,null,null,null,"Ivory Coast"]
[null,null,null,null,null,null,null,null,"Jamaica"]
[null,null,null,null,null,null,null,null,"Japan"]
[null,null,null,null,null,null,null,null,"Jordan"]
[null,null,null,null,null,null,null,null,"Kazakstan"]
[null,null,null,null,null,null,null,null,"Kenya"]
[null,null,null,null,null,null,null,null,"Kiribati"]
[null,null,null,null,null,null,null,null,"Kosovo"]
[null,null,null,null,null,null,null,null,"Kyrgyzstan"]
[null,null,null,null,null,null,null,null,"Laos"]
[null,null,null,null,null,null,null,null,"Lebanon"]
[null,null,null,null,null,null,null,null,"Lesotho"]
[null,null,null,null,null,null,null,null,"Liberia"]
[null,null,null,null,null,null,null,null,"Libya"]
[null,null,null,null,null,null,null,null,"Madagascar"]
[null,null,null,null,null,null,null,null,"Malawi"]
[null,null,null,null,null,null,null,null,"Malaysia"]
[null,null,null,null,null,null,null,null,"Maldives"]
[null,null,null,null,null,null,null,null,"Mali"]
[null,null,null,null,null,null,null,null,"Marshall Islands"]
[null,null,null,null,null,null,null,null,"Mauritania"]
[null,null,null,null,null,null,null,null,"Mauritius"]
[null,null,null,null,null,null,null,null,"Mexico"]
[null,null,null,null,null,null,null,null,"Micronesia - Federated States of-"]
[null,null,null,null,null,null,null,null,"Moldova"]
[null,null,null,null,null,null,null,null,"Mongolia"]
[null,null,null,null,null,null,null,null,"Montenegro"]
[null,null,null,null,null,null,null,null,"Morocco"]
[null,null,null,null,null,null,null,null,"Mozambique"]
[null,null,null,null,null,null,null,null,"Myanmar"]
[null,null,null,null,null,null,null,null,"Namibia"]
[null,null,null,null,null,null,null,null,"Nauru"]
[null,null,null,null,null,null,null,null,"Nepal"]
[null,null,null,null,null,null,null,null,"Nicaragua"]
[null,null,null,null,null,null,null,null,"Niger"]
[null,null,null,null,null,null,null,null,"Nigeria"]
[null,null,null,null,null,null,null,null,"Niue"]
[null,null,null,null,null,null,null,null,"Pakistan"]
[null,null,null,null,null,null,null,null,"Palau"]
[null,null,null,null,null,null,null,null,"Palestine"]
[null,null,null,null,null,null,null,null,"Panama"]
[null,null,null,null,null,null,null,null,"Papua New Guinea"]
[null,null,null,null,null,null,null,null,"Paraguay"]
[null,null,null,null,null,null,null,null,"Peru"]
[null,null,null,null,null,null,null,null,"Philippines"]
[null,null,null,null,null,null,null,null,"Russia"]
[null,null,null,null,null,null,null,null,"Rwanda"]
[null,null,null,null,null,null,null,null,"Saint Kitts and Nevis"]
[null,null,null,null,null,null,null,null,"Saint Lucia"]
[null,null,null,null,null,null,null,null,"Saint Vincent and the Grenadines"]
[null,null,null,null,null,null,null,null,"Samoa"]
[null,null,null,null,null,null,null,null,"Sao Tome and Principe"]
[null,null,null,null,null,null,null,null,"Senegal"]
[null,null,null,null,null,null,null,null,"Serbia"]
[null,null,null,null,null,null,null,null,"Seychelles"]
[null,null,null,null,null,null,null,null,"Sierra Leone"]
[null,null,null,null,null,null,null,null,"Solomon Islands"]
[null,null,null,null,null,null,null,null,"Somalia"]
[null,null,null,null,null,null,null,null,"South Africa"]
[null,null,null,null,null,null,null,null,"South Sudan"]
[null,null,null,null,null,null,null,null,"Sri Lanka"]
[null,null,null,null,null,null,null,null,"Sudan"]
[null,null,null,null,null,null,null,null,"Suriname"]
[null,null,null,null,null,null,null,null,"Switzerland"]
[null,null,null,null,null,null,null,null,"Swaziland"]
[null,null,null,null,null,null,null,null,"Syria"]
[null,null,null,null,null,null,null,null,"Tajikistan"]
[null,null,null,null,null,null,null,null,"Tanzania"]
[null,null,null,null,null,null,null,null,"Thailand"]
[null,null,null,null,null,null,null,null,"Timor Leste - Republic of-"]
[null,null,null,null,null,null,null,null,"Togo"]
[null,null,null,null,null,null,null,null,"Tonga"]
[null,null,null,null,null,null,null,null,"Trinidad and Tobago"]
[null,null,null,null,null,null,null,null,"Tunisia"]
[null,null,null,null,null,null,null,null,"Turkmenistan"]
[null,null,null,null,null,null,null,null,"Tuvalu"]
[null,null,null,null,null,null,null,null,"Uganda"]
[null,null,null,null,null,null,null,null,"United States"]
[null,null,null,null,null,null,null,null,"Ukraine"]
[null,null,null,null,null,null,null,null,"Uruguay"]
[null,null,null,null,null,null,null,null,"Uzbekistan"]
[null,null,null,null,null,null,null,null,"Vanuatu"]
[null,null,null,null,null,null,null,null,"Venezuela"]
[null,null,null,null,null,null,null,null,"Vietnam"]
[null,null,null,null,null,null,null,null,"Yemen"]
[null,null,null,null,null,null,null,null,"Zambia"]
[null,null,null,null,null,null,null,null,"Zimbabwe"]