{"text_format":"1","workbook":"xlsx","n_sheets":10,"sheets":["Overview","Action  Plan","1. Costs linked to activities","2. Communication Costs","3. Travel & Subsistence costs","4. Personnel  costs","5. Indirect Costs","Co-financing  Income","Breakdown & Project Funding","Data sources"],"not_rendered":{"charts":0,"images":2,"macros":1,"external_links":0,"defined_names":87,"comments":0,"pivot_tables":0},"unopened":[],"bounds":{"document_bytes":16777216,"sheet_cells":100000,"rows_first":2000,"rows_last":500,"rows_between":2000,"halvings":0,"cell_chars":16384,"cell_head_chars":4096},"cells_cut":0,"cells_raw":0,"read":"whole","date_system":"1900"}

{"sheet":"Overview","index":0,"n_rows":86,"n_cols":14,"rows_kept":86,"cut":false,"hidden":false,"merged":[[17,5,17,9],[12,1,12,2],[15,1,15,9],[28,13,30,13],[25,1,25,3],[28,1,28,7],[18,1,18,3],[19,1,19,3],[24,1,24,3],[20,1,20,3],[21,1,21,3],[20,5,20,8],[21,5,21,8],[23,5,23,8],[22,1,22,3],[22,5,22,8],[26,1,26,3],[24,5,24,8],[23,11,24,11],[25,5,25,8],[26,7,26,8],[6,1,6,9],[7,1,7,9],[8,1,8,9],[10,1,10,2],[11,1,11,2],[10,4,10,9],[11,6,11,9],[23,1,23,2],[12,4,12,9],[13,1,13,2],[13,3,13,9],[19,7,19,8],[18,5,18,8],[17,1,17,4]]}
[]
[]
[]
[]
[null,null,null,"CREATIVE EUROPE - CULTURE"]
[]
[null,"Before completing this table please read carefully the Guidelines and Guide for applicants available here: \nhttps://eacea.ec.europa.eu/creative-europe/funding/support-european-cooperation-projects-2019_en "]
[null,"CALL FOR PROPOSALS – EACEA 34/2018 - 'Support for European Cooperation Projects 2019'"]
[]
[]
[null,"Action",null,null,{"$f":"IF(D11=\"\",\"Please select an action type\",\"\")","v":"Please select an action type"}]
[null,"Duration / Eligibility period",null,null,"to",null,{"$f":"IF(OR(D12=\"\",F12=\"\"),\"Please insert the eligibility period of the project (dd/mm/yyyy)\",\"\")","v":"Please insert the eligibility period of the project (dd/mm/yyyy)"}]
[null,"Project Acronym",null,null,{"$f":"IF(D13=\"\",\"Please fill in Project Acronym\",\"\")","v":"Please fill in Project Acronym"}]
[null,"Project Title"]
[]
{"$rows_left_out":72}
{"sheet":"Action  Plan","index":1,"n_rows":219,"n_cols":13,"rows_kept":219,"cut":false,"hidden":false,"merged":[[16,3,17,3],[11,1,11,2],[13,1,13,2],[14,1,14,2],[16,8,16,9],[12,1,12,2],[16,12,17,12],[7,1,7,10],[8,1,8,10],[9,1,9,10],[13,3,13,10],[14,3,14,10],[16,10,17,10],[16,1,17,1],[16,2,17,2],[16,4,17,4],[16,5,17,5],[16,6,17,6],[16,7,17,7]]}
[]
[]
[]
[]
[null,null,null,null,"CREATIVE EUROPE - CULTURE"]
[]
[]
[null,"Before completing this table please read carefully the Guidelines and Guide for applicants available here: \nhttps://eacea.ec.europa.eu/creative-europe/funding/support-european-cooperation-projects-2019_en"]
[null,"CALL FOR PROPOSALS – EACEA 34/2018 - 'Support for European Cooperation Projects 2019'"]
[]
[]
[null,"Action type",null,{"$f":"IF(Overview!D11=\"\",\"(to encode in overview sheet)\",Overview!D11)","v":"(to encode in overview sheet)"}]
[null,"Duration / Eligibility period",null,{"$f":"IF(Overview!D12=\"\",\"\",Overview!D12)","v":""},"to",{"$f":"IF(Overview!F12=\"\",\"\",Overview!F12)","v":""},{"$f":"IF(OR(D13=\"dd/mm/yyyy\",F13=\"dd/mm/yyyy\"),\"Please encode the eligibility period of the project in the Overview Sheet  (dd/mm/yyyy)\",\"\")","v":""}]
[null,"Project Acronym",null,{"$f":"IF(Overview!D13=\"\",\"(to encode in overview sheet)\",Overview!D13)","v":"(to encode in overview sheet)"}]
[null,"Project Title",null,{"$f":"IF(Overview!D14=\"\",\"(to encode in overview sheet)\",Overview!D14)","v":"(to encode in overview sheet)"}]
{"$rows_left_out":205}
{"sheet":"1. Costs linked to activities","index":2,"n_rows":15,"n_cols":13,"rows_kept":15,"cut":false,"hidden":false,"merged":[[10,12,11,12],[0,1,0,9],[1,1,1,9],[2,1,2,9],[3,1,8,1],[3,2,8,3],[3,5,8,6],[3,7,8,7],[10,9,11,9],[10,10,11,10],[10,1,11,1],[10,3,11,3],[10,8,11,8],[9,1,9,9],[10,2,11,2],[10,4,11,4],[10,5,11,5],[10,6,11,6],[10,7,11,7]]}
[]
[null,"1. COSTS DIRECTLY LINKED TO THE IMPLEMENTATION OF PROJECT ACTIVITIES"]
[]
[null,"Total (EUR)",{"$f":"SUM(K:K)","v":0},null,null,"Total (EUR) Financial support to third parties\n (Max. EUR 60.000 per third party)",null,{"$f":"SUMIF(H:H,'Data sources'!B13,'1. Costs linked to activities'!K:K)","v":0}]
[]
[]
[]
[]
[]
[]
[null,"Activity N°","Name of Activity\n(to encode in Action Plan sheet)","Work\nPackage\n(to encode in Action Plan  sheet)","Partner \nN°","Name of Partner\n(to encode in overview sheet)","Country\n(to encode in overview sheet)","Specification of the item","Explanation about nature, type of  the expense","Amount\n(EUR)","Total\n(EUR)",null,"Check\nData\nEncoding"]
[]
[null,null,{"$f":"IFERROR(IF(VLOOKUP(B13,'Action  Plan'!$B$20:$C$219,2,FALSE)=0,\"\",VLOOKUP(B13,'Action  Plan'!$B$20:$C$219,2,FALSE)),\"\")","v":""},{"$f":"IFERROR(IF(VLOOKUP(B13,'Action  Plan'!$B$20:$D$219,3,FALSE)=0,\"\",VLOOKUP(B13,'Action  Plan'!$B$20:$D$219,3,FALSE)),\"\")","v":""},null,{"$f":"IFERROR(IF(VLOOKUP(E13,Overview!$B$32:$C$86,2,FALSE)=0,\"\",VLOOKUP(E13,Overview!$B$32:$C$86,2,FALSE)),\"\")","v":""},{"$f":"IFERROR(IF(OR(VLOOKUP(E13,Overview!$B$32:$D$87,3,FALSE)=\"Country not found\",VLOOKUP(E13,Overview!$B$32:$D$87,3,FALSE)=0),\"\",VLOOKUP(E13,Overview!$B$32:$D$87,3,FALSE)),\"\")","v":""},null,null,0,{"$f":"IF(M13=\"Error\",0,ROUND(J13,2))","v":0},null,{"$f":"IF(OR(COUNTIF('Action  Plan'!$B$19:$B$218,B13)=0,COUNTIF(PartnerN°,E13)=0,COUNTIF('Data sources'!$B$4:$B$14,H13)=0,I13=\"\",J13=0),\"Error\",\"\")","v":"Error"}]
[null,null,{"$f":"IFERROR(IF(VLOOKUP(B14,'Action  Plan'!$B$20:$C$219,2,FALSE)=0,\"\",VLOOKUP(B14,'Action  Plan'!$B$20:$C$219,2,FALSE)),\"\")","v":""},{"$f":"IFERROR(IF(VLOOKUP(B14,'Action  Plan'!$B$20:$D$219,3,FALSE)=0,\"\",VLOOKUP(B14,'Action  Plan'!$B$20:$D$219,3,FALSE)),\"\")","v":""},null,{"$f":"IFERROR(IF(VLOOKUP(E14,Overview!$B$32:$C$86,2,FALSE)=0,\"\",VLOOKUP(E14,Overview!$B$32:$C$86,2,FALSE)),\"\")","v":""},{"$f":"IFERROR(IF(OR(VLOOKUP(E14,Overview!$B$32:$D$87,3,FALSE)=\"Country not found\",VLOOKUP(E14,Overview!$B$32:$D$87,3,FALSE)=0),\"\",VLOOKUP(E14,Overview!$B$32:$D$87,3,FALSE)),\"\")","v":""},null,null,null,{"$f":"IF(M14=\"Error\",0,ROUND(J14,2))","v":0},null,{"$f":"IF(OR(COUNTIF('Action  Plan'!$B$19:$B$218,B14)=0,COUNTIF(PartnerN°,E14)=0,COUNTIF('Data sources'!$B$4:$B$14,H14)=0,I14=\"\",J14=0),\"Error\",\"\")","v":"Error"}]
[null,null,{"$f":"IFERROR(IF(VLOOKUP(B15,'Action  Plan'!$B$20:$C$219,2,FALSE)=0,\"\",VLOOKUP(B15,'Action  Plan'!$B$20:$C$219,2,FALSE)),\"\")","v":""},{"$f":"IFERROR(IF(VLOOKUP(B15,'Action  Plan'!$B$20:$D$219,3,FALSE)=0,\"\",VLOOKUP(B15,'Action  Plan'!$B$20:$D$219,3,FALSE)),\"\")","v":""},null,{"$f":"IFERROR(IF(VLOOKUP(E15,Overview!$B$32:$C$86,2,FALSE)=0,\"\",VLOOKUP(E15,Overview!$B$32:$C$86,2,FALSE)),\"\")","v":""},{"$f":"IFERROR(IF(OR(VLOOKUP(E15,Overview!$B$32:$D$87,3,FALSE)=\"Country not found\",VLOOKUP(E15,Overview!$B$32:$D$87,3,FALSE)=0),\"\",VLOOKUP(E15,Overview!$B$32:$D$87,3,FALSE)),\"\")","v":""},null,null,null,{"$f":"IF(M15=\"Error\",0,ROUND(J15,2))","v":0},null,{"$f":"IF(OR(COUNTIF('Action  Plan'!$B$19:$B$218,B15)=0,COUNTIF(PartnerN°,E15)=0,COUNTIF('Data sources'!$B$4:$B$14,H15)=0,I15=\"\",J15=0),\"Error\",\"\")","v":"Error"}]
{"$rows_left_out":1}
{"sheet":"2. Communication Costs","index":3,"n_rows":14,"n_cols":13,"rows_kept":14,"cut":false,"hidden":false,"merged":[[10,8,11,8],[10,9,11,9],[10,12,11,12],[10,10,11,10],[0,1,0,9],[1,1,1,9],[2,1,2,9],[3,1,8,1],[3,2,8,3],[3,4,8,9],[9,1,9,9],[10,1,11,1],[10,2,11,2],[10,3,11,3],[10,4,11,4],[10,5,11,5],[10,6,11,6],[10,7,11,7]]}
[]
[null,"                                      2. COMMUNICATION, PROMOTION AND DISSEMINATION COSTS AND COSTS OF EXPLOITATION OF RESULTS"]
[]
[null,"Total (EUR)",{"$f":"SUM(K:K)","v":0}]
[]
[]
[]
[]
[]
[]
[null,"Activity N°","Name of Activity\n(to encode in Action Plan sheet)","Work\nPackage\n(to encode in Action Plan  sheet)","Partner \nN°","Name of Partner\n(to encode in overview sheet)","Country\n(to encode in overview sheet)","Specification of the item","Explanation about nature, type of  the expense","Amount\n(EUR)","Total\n(EUR)",null,"Check\nData\nEncoding"]
[]
[null,null,{"$f":"IFERROR(IF(VLOOKUP(B13,'Action  Plan'!$B$20:$C$219,2,FALSE)=0,\"\",VLOOKUP(B13,'Action  Plan'!$B$20:$C$219,2,FALSE)),\"\")","v":""},{"$f":"IFERROR(IF(VLOOKUP(B13,'Action  Plan'!$B$20:$D$219,3,FALSE)=0,\"\",VLOOKUP(B13,'Action  Plan'!$B$20:$D$219,3,FALSE)),\"\")","v":""},null,{"$f":"IFERROR(IF(VLOOKUP(E13,Overview!$B$32:$C$86,2,FALSE)=0,\"\",VLOOKUP(E13,Overview!$B$32:$C$86,2,FALSE)),\"\")","v":""},{"$f":"IFERROR(IF(OR(VLOOKUP(E13,Overview!$B$32:$D$87,3,FALSE)=\"Country not found\",VLOOKUP(E13,Overview!$B$32:$D$87,3,FALSE)=0),\"\",VLOOKUP(E13,Overview!$B$32:$D$87,3,FALSE)),\"\")","v":""},null,null,0,{"$f":"IF(M13=\"Error\",0,ROUND(J13,2))","v":0},null,{"$f":"IF(OR(COUNTIF('Action  Plan'!$B$19:$B$218,B13)=0,COUNTIF(PartnerN°,E13)=0,COUNTIF('Data sources'!$B$17:$B$24,H13)=0,I13=\"\",J13=0),\"Error\",\"\")","v":"Error"}]
[null,null,{"$f":"IFERROR(IF(VLOOKUP(B14,'Action  Plan'!$B$20:$C$219,2,FALSE)=0,\"\",VLOOKUP(B14,'Action  Plan'!$B$20:$C$219,2,FALSE)),\"\")","v":""},{"$f":"IFERROR(IF(VLOOKUP(B14,'Action  Plan'!$B$20:$D$219,3,FALSE)=0,\"\",VLOOKUP(B14,'Action  Plan'!$B$20:$D$219,3,FALSE)),\"\")","v":""},null,{"$f":"IFERROR(IF(VLOOKUP(E14,Overview!$B$32:$C$86,2,FALSE)=0,\"\",VLOOKUP(E14,Overview!$B$32:$C$86,2,FALSE)),\"\")","v":""},{"$f":"IFERROR(IF(OR(VLOOKUP(E14,Overview!$B$32:$D$87,3,FALSE)=\"Country not found\",VLOOKUP(E14,Overview!$B$32:$D$87,3,FALSE)=0),\"\",VLOOKUP(E14,Overview!$B$32:$D$87,3,FALSE)),\"\")","v":""},null,null,0,{"$f":"IF(M14=\"Error\",0,ROUND(J14,2))","v":0},null,{"$f":"IF(OR(COUNTIF('Action  Plan'!$B$19:$B$218,B14)=0,COUNTIF(PartnerN°,E14)=0,COUNTIF('Data sources'!$B$17:$B$24,H14)=0,I14=\"\",J14=0),\"Error\",\"\")","v":"Error"}]

{"sheet":"3. Travel & Subsistence costs","index":4,"n_rows":14,"n_cols":20,"rows_kept":14,"cut":false,"hidden":false,"merged":[[1,1,1,17],[8,1,8,2],[10,3,11,3],[10,4,11,4],[10,7,11,7],[10,9,11,9],[10,11,11,11],[10,8,11,8],[10,6,11,6],[10,5,11,5],[10,1,11,1],[10,2,11,2],[3,1,4,2],[5,1,6,2],[3,3,4,3],[5,3,6,3],[10,10,11,10],[10,13,11,13],[10,15,11,15],[10,19,11,19],[10,17,11,17],[10,16,11,16],[10,12,11,12],[10,14,11,14]]}
[]
[null,"3. TRAVEL & SUBSISTENCE COSTS"]
[]
[null,"Total Travel Costs (EUR)",null,{"$f":"SUM(M:M)","v":0}]
[]
[null,"Total Costs of Stay (EUR)",null,{"$f":"SUM(Q:Q)","v":0}]
[]
[]
[null,"Total Chapter 3",null,{"$f":"SUM(D4:D6)","v":0}]
[]
[null,"Activity N°","Name of Activity\n(to encode in Action Plan sheet)","Work\nPackage\n(to encode in Action Plan  sheet)","Partner \nN°","Name of Partner\n(to encode in overview sheet)","Country\n(to encode in overview sheet)","CITY of Departure","Person travelling","City of Destination","Unit cost per travel","Number of \nParticipants","Total Travel \nCosts\n(EUR)","Unit cost per day","Number of \ndays (per participant)","Number of \nParticipants","Costs of\nStay\n(EUR)","Total \n(EUR)",null,"Check\nData\nEncoding"]
[]
[null,null,{"$f":"IFERROR(IF(VLOOKUP(B13,'Action  Plan'!$B$20:$C$219,2,FALSE)=0,\"\",VLOOKUP(B13,'Action  Plan'!$B$20:$C$219,2,FALSE)),\"\")","v":""},{"$f":"IFERROR(IF(VLOOKUP(B13,'Action  Plan'!$B$20:$D$219,3,FALSE)=0,\"\",VLOOKUP(B13,'Action  Plan'!$B$20:$D$219,3,FALSE)),\"\")","v":""},null,{"$f":"IFERROR(IF(VLOOKUP(E13,Overview!$B$32:$C$86,2,FALSE)=0,\"\",VLOOKUP(E13,Overview!$B$32:$C$86,2,FALSE)),\"\")","v":""},{"$f":"IFERROR(IF(OR(VLOOKUP(E13,Overview!$B$32:$D$87,3,FALSE)=\"Country not found\",VLOOKUP(E13,Overview!$B$32:$D$87,3,FALSE)=0),\"\",VLOOKUP(E13,Overview!$B$32:$D$87,3,FALSE)),\"\")","v":""},null,null,null,0,0,{"$f":"K13*L13","v":0},0,0,0,{"$f":"N13*O13*P13","v":0},{"$f":"IF(T13=\"Error\",0,ROUND(M13+Q13,2))","v":0},null,{"$f":"IF(OR(COUNTIF('Action  Plan'!$B$19:$B$218,B13)=0,COUNTIF(PartnerN°,E13)=0,H13=\"\",COUNTIF('Data sources'!$L$22:$L$24,I13)=0,J13=\"\",K13=0,L13=0,N13=0,O13=0,P13=0,M13+Q13=0),\"Error\",\"\")","v":"Error"}]
[null,null,{"$f":"IFERROR(IF(VLOOKUP(B14,'Action  Plan'!$B$20:$C$219,2,FALSE)=0,\"\",VLOOKUP(B14,'Action  Plan'!$B$20:$C$219,2,FALSE)),\"\")","v":""},{"$f":"IFERROR(IF(VLOOKUP(B14,'Action  Plan'!$B$20:$D$219,3,FALSE)=0,\"\",VLOOKUP(B14,'Action  Plan'!$B$20:$D$219,3,FALSE)),\"\")","v":""},null,{"$f":"IFERROR(IF(VLOOKUP(E14,Overview!$B$32:$C$86,2,FALSE)=0,\"\",VLOOKUP(E14,Overview!$B$32:$C$86,2,FALSE)),\"\")","v":""},{"$f":"IFERROR(IF(OR(VLOOKUP(E14,Overview!$B$32:$D$87,3,FALSE)=\"Country not found\",VLOOKUP(E14,Overview!$B$32:$D$87,3,FALSE)=0),\"\",VLOOKUP(E14,Overview!$B$32:$D$87,3,FALSE)),\"\")","v":""},null,null,null,null,0,{"$f":"IF(K14=\"n/a\",0,K14*L14)","v":0},null,0,0,{"$f":"IF(N14=\"n/a\",0,N14*O14*P14)","v":0},{"$f":"IF(T14=\"Error\",0,ROUND(M14+Q14,2))","v":0},null,{"$f":"IF(OR(COUNTIF('Action  Plan'!$B$19:$B$218,B14)=0,COUNTIF(PartnerN°,E14)=0,H14=\"\",COUNTIF('Data sources'!$L$22:$L$24,I14)=0,J14=\"\",L14=0,O14=0,P14=0,M14+Q14=0),\"Error\",\"\")","v":"Error"}]

{"sheet":"4. Personnel  costs","index":5,"n_rows":14,"n_cols":25,"rows_kept":14,"cut":false,"hidden":false,"merged":[[1,1,1,21],[2,1,2,21],[3,1,3,2],[3,5,8,21],[4,1,4,2],[7,1,7,2],[8,1,8,2],[5,1,6,2],[5,3,6,3],[10,24,11,24],[10,22,11,22],[9,1,9,21],[10,3,11,3],[10,4,11,4],[10,5,11,5],[10,6,11,6],[10,1,11,1],[10,2,11,2],[10,7,10,11],[10,12,10,16],[10,17,10,21]]}
[]
[null,"4. PERSONNEL COSTS"]
[]
[null,null,null,"Total (EUR)"]
[null,"Salaries of personnel and fees for project management",null,{"$f":"SUM(L:L)","v":0}]
[null,"External professional services ",null,{"$f":"SUM(Q:Q)","v":0}]
[]
[null,"Fees, remuneration of artists, scientific personnel and technicians",null,{"$f":"SUM(V:V)","v":0}]
[null,null,null,{"$f":"SUM(D5:D8)","v":0}]
[]
[null,"Activity N°","Name of Activity\n(to encode in Action Plan sheet)","Work\nPackage\n(to encode in Action Plan  sheet)","Partner \nN°","Name of Partner\n(to encode in overview sheet)","Country\n(to encode in overview sheet)","Salaries",null,null,null,null,"External professional services ",null,null,null,null,"Fees, remuneration of artists, scientific personnel and technicians",null,null,null,null,"Total \n(EUR)",null,"Check\nData\nEncoding"]
[null,null,null,null,null,null,null,"Specification of the item","Explanation about nature, type of  the expense","Number of \ndays","Unit cost \nper day","Total\n(EUR)","Specification of the item","Explanation about nature, type of  the expense","Number of \ndays","Unit cost \nper day","Total\n(EUR)","Specification of the item","Explanation about nature, type of  the expense","Number of \ndays","Unit cost \nper day","Total\n(EUR)"]
[null,null,{"$f":"IFERROR(IF(VLOOKUP(B13,'Action  Plan'!$B$20:$C$219,2,FALSE)=0,\"\",VLOOKUP(B13,'Action  Plan'!$B$20:$C$219,2,FALSE)),\"\")","v":""},{"$f":"IFERROR(IF(VLOOKUP(B13,'Action  Plan'!$B$20:$D$219,3,FALSE)=0,\"\",VLOOKUP(B13,'Action  Plan'!$B$20:$D$219,3,FALSE)),\"\")","v":""},null,{"$f":"IFERROR(IF(VLOOKUP(E13,Overview!$B$32:$C$86,2,FALSE)=0,\"\",VLOOKUP(E13,Overview!$B$32:$C$86,2,FALSE)),\"\")","v":""},{"$f":"IFERROR(IF(OR(VLOOKUP(E13,Overview!$B$32:$D$87,3,FALSE)=\"Country not found\",VLOOKUP(E13,Overview!$B$32:$D$87,3,FALSE)=0),\"\",VLOOKUP(E13,Overview!$B$32:$D$87,3,FALSE)),\"\")","v":""},null,null,0,0,{"$f":"ROUND(J13*K13,2)","v":0},null,null,0,0,{"$f":"ROUND(O13*P13,2)","v":0},null,null,0,0,{"$f":"ROUND(T13*U13,2)","v":0},{"$f":"IF(Y13=\"Error\",0,ROUND(L13+Q13+V13,2))","v":0},null,{"$f":"IF(OR(COUNTIF('Action  Plan'!$B$19:$B$218,B13)=0,COUNTIF(PartnerN°,E13)=0,COUNTIF('Data sources'!$B$33:$B$37,H13)=0,I13=\"\",COUNTIF('Data sources'!$B$39:$B$46,M13)=0,N13=\"\",COUNTIF('Data sources'!$B$48:$B$55,'4. Personnel  costs'!R13)=0,S13=\"\",L13+Q13+V13=0),\"Error\",\"\")","v":"Error"}]
[null,null,{"$f":"IFERROR(IF(VLOOKUP(B14,'Action  Plan'!$B$20:$C$219,2,FALSE)=0,\"\",VLOOKUP(B14,'Action  Plan'!$B$20:$C$219,2,FALSE)),\"\")","v":""},{"$f":"IFERROR(IF(VLOOKUP(B14,'Action  Plan'!$B$20:$D$219,3,FALSE)=0,\"\",VLOOKUP(B14,'Action  Plan'!$B$20:$D$219,3,FALSE)),\"\")","v":""},null,{"$f":"IFERROR(IF(VLOOKUP(E14,Overview!$B$32:$C$86,2,FALSE)=0,\"\",VLOOKUP(E14,Overview!$B$32:$C$86,2,FALSE)),\"\")","v":""},{"$f":"IFERROR(IF(OR(VLOOKUP(E14,Overview!$B$32:$D$87,3,FALSE)=\"Country not found\",VLOOKUP(E14,Overview!$B$32:$D$87,3,FALSE)=0),\"\",VLOOKUP(E14,Overview!$B$32:$D$87,3,FALSE)),\"\")","v":""},null,null,0,0,{"$f":"ROUND(J14*K14,2)","v":0},null,null,0,0,{"$f":"ROUND(O14*P14,2)","v":0},null,null,0,0,{"$f":"ROUND(T14*U14,2)","v":0},{"$f":"IF(Y14=\"Error\",0,ROUND(L14+Q14+V14,2))","v":0},null,{"$f":"IF(OR(COUNTIF('Action  Plan'!$B$19:$B$218,B14)=0,COUNTIF(PartnerN°,E14)=0,COUNTIF('Data sources'!$B$33:$B$37,H14)=0,I14=\"\",COUNTIF('Data sources'!$B$39:$B$46,M14)=0,N14=\"\",COUNTIF('Data sources'!$B$48:$B$55,'4. Personnel  costs'!R14)=0,S14=\"\",L14+Q14+V14=0),\"Error\",\"\")","v":"Error"}]

{"sheet":"5. Indirect Costs","index":6,"n_rows":14,"n_cols":9,"rows_kept":14,"cut":false,"hidden":false,"merged":[[10,4,11,4],[10,5,11,5],[10,8,11,8],[0,1,0,8],[2,1,2,8],[3,1,8,1],[3,2,8,3],[10,6,11,6],[1,1,1,9],[3,4,8,9],[9,1,9,8],[10,1,11,1],[10,2,11,2],[10,3,11,3]]}
[]
[null,"5. INDIRECT COSTS"]
[]
[null,"Total (EUR)",{"$f":"SUM(G:G)","v":0},null,"The total of indirect costs cannot exceed 7% of the total direct costs [i.e. chapters (1) + (2) + (3) + (4)]\n'Premises and related expenses (e.g. office rent, insurance, electricity, water, cleaning, …) and office expenses and consumables (e.g. telephone / fax / internet, postage and mailing, photocopies, depreciation of equipment, …)"]
[]
[]
[]
[]
[]
[]
[null,"Partner \nN°","Name of Partner\n(to encode in overview sheet)","Country\n(to encode in overview sheet)","Nature, Type and specification of the  indirect costs","Amount\n(EUR)","Total\n(EUR)",null,"Check\nData\nEncoding"]
[]
[null,null,{"$f":"IFERROR(IF(VLOOKUP(B13,Overview!$B$32:$C$86,2,FALSE)=0,\"\",VLOOKUP(B13,Overview!$B$32:$C$86,2,FALSE)),\"\")","v":""},{"$f":"IFERROR(IF(OR(VLOOKUP(B13,Overview!$B$32:$D$87,3,FALSE)=\"Country not found\",VLOOKUP(B13,Overview!$B$32:$D$87,3,FALSE)=0),\"\",VLOOKUP(B13,Overview!$B$32:$D$87,3,FALSE)),\"\")","v":""},null,0,{"$f":"IF(I13=\"Error\",0,ROUND(F13,2))","v":0},null,{"$f":"IF(OR(COUNTIF(PartnerN°,B13)=0,E13=\"\",F13=0),\"Error\",\"\")","v":"Error"}]
[null,null,{"$f":"IFERROR(IF(VLOOKUP(B14,Overview!$B$32:$C$86,2,FALSE)=0,\"\",VLOOKUP(B14,Overview!$B$32:$C$86,2,FALSE)),\"\")","v":""},{"$f":"IFERROR(IF(OR(VLOOKUP(B14,Overview!$B$32:$D$87,3,FALSE)=\"Country not found\",VLOOKUP(B14,Overview!$B$32:$D$87,3,FALSE)=0),\"\",VLOOKUP(B14,Overview!$B$32:$D$87,3,FALSE)),\"\")","v":""},null,0,{"$f":"IF(I14=\"Error\",0,ROUND(F14,2))","v":0},null,{"$f":"IF(OR(COUNTIF(PartnerN°,B14)=0,E14=\"\",F14=0),\"Error\",\"\")","v":"Error"}]

{"sheet":"Co-financing  Income","index":7,"n_rows":14,"n_cols":11,"rows_kept":14,"cut":false,"hidden":false,"merged":[[10,10,11,10],[0,1,0,8],[2,1,2,8],[9,1,9,8],[1,1,1,8],[10,8,11,8],[10,5,11,5],[3,2,8,2],[3,1,8,1],[10,1,11,1],[10,2,11,2],[10,3,11,3],[10,6,11,6],[10,7,11,7],[10,4,11,4],[3,3,8,8]]}
[]
[null,"Information for the Co-financing and income of the project"]
[]
[null,"Total (EUR)",{"$f":"SUM(I:I)","v":0}]
[]
[]
[]
[]
[]
[]
[null,"Partner \nN°","Name of Partner\n(to encode in overview sheet)","Country\n(to encode in overview sheet)","Category of revenue","Source of Co-financing\nInsertt N/A for 'Distribution of the EU grant requested between partners'","Justification","Amount\n(EUR)","Total\n(EUR)",null,"Check\nData\nEncoding"]
[]
[null,null,{"$f":"IFERROR(IF(VLOOKUP(B13,PartnerN°Ref,2,FALSE)=0,\"\",VLOOKUP(B13,PartnerN°Ref,2,FALSE)),\"\")","v":""},{"$f":"IFERROR(IF(OR(VLOOKUP(B13,Overview!$B$32:$D$87,3,FALSE)=\"Country not found\",VLOOKUP(B13,Overview!$B$32:$D$87,3,FALSE)=0),\"\",VLOOKUP(B13,Overview!$B$32:$D$87,3,FALSE)),\"\")","v":""},null,null,null,0,{"$f":"IF(K13=\"Error\",0,ROUND(H13,2))","v":0},null,{"$f":"IF(OR(COUNTIF(PartnerN°,B13)=0,COUNTIF('Data sources'!$L$4:$L$8,E13)=0,F13=0,G13=\"\",H13=0),\"Error\",\"\")","v":"Error"}]
[null,null,{"$f":"IFERROR(IF(VLOOKUP(B14,PartnerN°Ref,2,FALSE)=0,\"\",VLOOKUP(B14,PartnerN°Ref,2,FALSE)),\"\")","v":""},{"$f":"IFERROR(IF(OR(VLOOKUP(B14,Overview!$B$32:$D$87,3,FALSE)=\"Country not found\",VLOOKUP(B14,Overview!$B$32:$D$87,3,FALSE)=0),\"\",VLOOKUP(B14,Overview!$B$32:$D$87,3,FALSE)),\"\")","v":""},null,null,null,0,{"$f":"IF(K14=\"Error\",0,ROUND(H14,2))","v":0},null,{"$f":"IF(OR(COUNTIF(PartnerN°,B14)=0,COUNTIF('Data sources'!$L$4:$L$8,E14)=0,F14=0,G14=\"\",H14=0),\"Error\",\"\")","v":"Error"}]

{"sheet":"Breakdown & Project Funding","index":8,"n_rows":276,"n_cols":9,"rows_kept":276,"cut":false,"hidden":false,"merged":[[74,1,74,2],[72,1,72,8],[73,1,73,7],[12,1,12,7],[0,1,0,7],[11,1,11,7],[10,1,10,7],[2,1,2,7],[1,1,1,7]]}
[]
[null,"Budget Breakdown by Work Package / Budget Chapters"]
[]
[null,"Work\nPackage","1. Costs linked to activities","2. Communication \nCosts","3. Travel & Subsistence\nCosts","4. Personnel \nCosts","5. Indirect costs","Total\n(EUR)"]
[null,"Preparatory Phase",{"$f":"SUMIF('1. Costs linked to activities'!D:D,B5,'1. Costs linked to activities'!K:K)","v":0},{"$f":"SUMIF('2. Communication Costs'!D:D,B5,'2. Communication Costs'!K:K)","v":0},{"$f":"SUMIF('3. Travel & Subsistence costs'!D:D,B5,'3. Travel & Subsistence costs'!R:R)","v":0},{"$f":"SUMIF('4. Personnel  costs'!D:D,B5,'4. Personnel  costs'!W:W)","v":0},null,{"$f":"SUM(C5:G5)","v":0}]
[null,"Management",{"$f":"SUMIF('1. Costs linked to activities'!D:D,B6,'1. Costs linked to activities'!K:K)","v":0},{"$f":"SUMIF('2. Communication Costs'!D:D,B6,'2. Communication Costs'!K:K)","v":0},{"$f":"SUMIF('3. Travel & Subsistence costs'!D:D,B6,'3. Travel & Subsistence costs'!R:R)","v":0},{"$f":"SUMIF('4. Personnel  costs'!D:D,B6,'4. Personnel  costs'!W:W)","v":0},null,{"$f":"SUM(C6:G6)","v":0}]
[null,"Communication and Dissemination",{"$f":"SUMIF('1. Costs linked to activities'!D:D,B7,'1. Costs linked to activities'!K:K)","v":0},{"$f":"SUMIF('2. Communication Costs'!D:D,B7,'2. Communication Costs'!K:K)","v":0},{"$f":"SUMIF('3. Travel & Subsistence costs'!D:D,B7,'3. Travel & Subsistence costs'!R:R)","v":0},{"$f":"SUMIF('4. Personnel  costs'!D:D,B7,'4. Personnel  costs'!W:W)","v":0},null,0]
[null,"Evaluation and Quality Assessment",{"$f":"SUMIF('1. Costs linked to activities'!D:D,B8,'1. Costs linked to activities'!K:K)","v":0},{"$f":"SUMIF('2. Communication Costs'!D:D,B8,'2. Communication Costs'!K:K)","v":0},{"$f":"SUMIF('3. Travel & Subsistence costs'!D:D,B8,'3. Travel & Subsistence costs'!R:R)","v":0},{"$f":"SUMIF('4. Personnel  costs'!D:D,B8,'4. Personnel  costs'!W:W)","v":0},null,0]
[null,"Implementation (cultural activities, publication, studies, research, etc.)",{"$f":"SUMIF('1. Costs linked to activities'!D:D,B9,'1. Costs linked to activities'!K:K)","v":0},{"$f":"SUMIF('2. Communication Costs'!D:D,B9,'2. Communication Costs'!K:K)","v":0},{"$f":"SUMIF('3. Travel & Subsistence costs'!D:D,B9,'3. Travel & Subsistence costs'!R:R)","v":0},{"$f":"SUMIF('4. Personnel  costs'!D:D,B9,'4. Personnel  costs'!W:W)","v":0},null,0]
[null,"TOTAL",{"$f":"SUM(C5:C9)","v":0},{"$f":"SUM(D5:D9)","v":0},{"$f":"SUM(E5:E9)","v":0},{"$f":"SUM(F5:F9)","v":0},{"$f":"+Overview!E24","v":0},0]
[]
[null,"Budget Breakdown by Partner / Work Package"]
[]
[null,"TOTAL",{"$f":"SUM(C16:C70)","v":0},{"$f":"SUM(D16:D70)","v":0},{"$f":"SUM(E16:E70)","v":0},{"$f":"SUM(F16:F70)","v":0},{"$f":"SUM(G16:G70)","v":0},{"$f":"SUM(C14:G14)","v":0}]
[null,"Partner\nN°",{"$f":"B5","v":"Preparatory Phase"},{"$f":"B6","v":"Management"},{"$f":"B7","v":"Communication and Dissemination"},{"$f":"B8","v":"Evaluation and Quality Assessment"},{"$f":"B9","v":"Implementation (cultural activities, publication, studies, research, etc.)"},"Total\n(EUR)"]
{"$rows_left_out":262}
{"sheet":"Data sources","index":9,"n_rows":193,"n_cols":12,"rows_kept":193,"cut":false,"hidden":true,"merged":[[24,1,24,6],[25,1,25,6],[14,1,14,6],[15,1,15,6],[2,1,2,6],[46,1,46,6],[29,1,29,6],[30,1,30,6],[31,1,31,6],[37,1,37,6],[69,2,70,6],[55,1,55,6],[56,1,56,6],[57,1,57,6],[58,1,58,6],[59,1,59,6],[60,1,60,6],[61,1,61,6],[62,1,62,6],[63,1,63,6],[64,1,64,6],[67,1,67,6]]}
[]
[]
[null,"COSTS DIRECTLY LINKED TO THE IMPLEMENTATION OF PROJECT ACTIVITIES",null,null,null,null,null,null,"Work packages",null,null,"List of income"]
[null,"Purchase of rights",null,null,null,null,null,null,"Preparatory Phase",null,null,"Distribution of the EU grant requested between partners"]
[null,"Premises costs",null,null,null,null,null,null,"Management",null,null,"Income generated by the project"]
[null,"Equipment costs",null,null,null,null,null,null,"Communication and Dissemination",null,null,"Self-financing in own and raised funds"]
[null,"Purchase of materials",null,null,null,null,null,null,"Evaluation and Quality Assessment",null,null,"Contributions from private sources"]
[null,"Purchase of equipment (depreciation only)",null,null,null,null,null,null,"Implementation (cultural activities, publication, studies, research, etc.)",null,null,"Contributions from public sources"]
[null,"Transport of equipment"]
[null,"Insurance ",null,null,null,null,null,null,"Country"]
[null,"Scenography",null,null,null,null,null,null,"Austria"]
[null,"Catering",null,null,null,null,null,null,"Belgium",null,null,"Priorities for Cooperation Projects 2019"]
[null,"Financial support to third parties = Prizes and/or Bursaries (please specify)",null,null,null,null,null,null,"Bulgaria",null,null,"A. transnational mobility"]
[null,"Other (please specify)",null,null,null,null,null,null,"Croatia",null,null,"B. audience development"]
[null,null,null,null,null,null,null,null,"Cyprus",null,null,"C.1. capacity building – digitisation"]
{"$rows_left_out":178}